program: Gaussian 09
title: 000268389
version: EM64L-G09RevD.01
frameworkgroup: C1[X(C22H28N4O2)]
method: RPBEPBE
basis: SDD
operation: Freq
keyword: #p
keyword: freq=noraman
keyword: PBEPBE/SDD
title: #p freq=noraman PBEPBE/SDD
converged: YES YES NO NO
title: Mulliken charges:
elementType: O O N N N N C C C C C C C C C C C C C C C C C C C C C C H H H H H H H H H H H H H H H H H H H H H H H H H H H H
charge: -0.292682 -0.292682 -0.105780 -0.105781 -0.024974 -0.024974 -0.361843 -0.367407 -0.367407 -0.361843 -0.366898 -0.366898 0.251901 0.251901 0.229609 0.229609 -0.360253 -0.360253 -0.360936 -0.360936 -0.247729 -0.247729 -0.242076 -0.242077 -0.239667 -0.239667 -0.687671 -0.687671 0.218054 0.227521 0.214510 0.239167 0.239167 0.214510 0.227521 0.218054 0.239676 0.239676 0.266743 0.266743 0.240331 0.240330 0.223322 0.223322 0.222060 0.222060 0.208178 0.208116 0.208116 0.208178 0.230278 0.208792 0.229658 0.208792 0.229658 0.230278
chargesum: 0.00000
title: Mulliken charges with hydrogens summed into heavy atoms:
elementType: O O N N N N C C C C C C C C C C C C C C C C C C C C C C
charge: -0.292682 -0.292682 -0.105780 -0.105781 -0.024974 -0.024974 0.083732 0.086270 0.086270 0.083732 -0.127222 -0.127222 0.251901 0.251901 0.229609 0.229609 -0.093510 -0.093510 -0.120605 -0.120605 -0.024407 -0.024407 -0.020016 -0.020016 0.176627 0.176627 -0.018943 -0.018943
polarizability: 5.51255204e+02 -2.88170533e+01 3.13471157e+02 2.93989957e+00 -2.60472498e-01 1.43154109e+02
1716.lowfreq: -0.0013 -0.0002 0.0010 0.7692 2.4787 6.5821 11.0582 15.5817 28.7704
frequency: 11.0582 15.5817 28.7704 40.0555 49.0499 54.3868 68.1341 69.3623 86.3717 106.6674 110.3047 123.9221 126.0324 133.7169 158.4237 186.4438 191.5783 209.6146 212.7198 241.1909 248.1332 249.2722 255.3929 272.4586 292.8534 299.2517 310.9165 330.6719 330.7363 340.6392 360.4064 420.2038 424.8906 459.5045 477.0347 478.3144 494.4466 520.8876 548.0496 548.8818 550.0948 577.1532 594.7535 596.7975 637.1936 660.7472 740.4185 740.6911 742.8274 753.7979 753.8919 754.0223 776.7606 791.1487 827.5949 827.5985 830.7696 858.6977 858.8709 867.8425 875.4026 907.8724 908.1055 908.7803 909.3512 941.3398 941.3731 969.0622 983.1709 983.2172 983.7696 1015.9630 1037.3054 1037.5139 1043.6247 1043.7864 1049.0230 1062.8858 1091.5986 1098.9835 1115.6522 1116.9814 1124.7747 1137.0743 1137.1009 1137.3840 1155.7523 1170.5769 1170.7595 1191.3594 1196.5251 1198.7791 1227.7010 1229.2423 1235.0606 1263.9329 1263.9365 1271.7947 1284.4830 1290.2367 1293.4466 1300.2218 1339.1395 1341.6918 1350.7228 1359.5294 1360.6853 1368.0018 1373.9582 1374.7435 1397.0105 1397.1842 1400.1045 1400.2573 1439.0034 1439.2616 1457.2924 1459.2703 1462.1469 1462.1526 1463.9990 1470.6713 1473.3368 1473.4923 1482.3667 1482.4084 1494.0313 1494.0393 1555.5951 1557.6607 1588.5785 1588.8279 1603.7076 1603.7484 2919.6510 2922.0635 2931.6476 2935.5286 2954.6612 2954.7209 2995.3377 2995.3405 3012.6801 3012.6925 3052.4829 3052.8525 3082.8305 3082.8696 3084.2174 3084.7753 3092.9779 3093.0060 3103.2062 3103.2201 3128.3968 3128.4057 3145.8670 3145.8730 3162.4153 3162.4217 3171.5020 3171.5606
redmass: 4.3990 5.1891 4.7518 2.9674 4.4325 4.5288 3.8439 3.8384 3.0713 2.1795 3.5433 2.2086 4.5049 3.2252 4.3126 3.8437 2.8832 4.0315 3.1659 2.3407 1.2210 1.3242 4.0788 3.9986 3.0675 2.9730 2.9399 3.8417 3.4962 4.3548 2.8292 5.1090 4.6041 3.3208 3.1867 3.2696 6.2073 5.0946 4.4141 3.5792 3.7042 4.0334 6.3669 5.8947 5.7643 2.5524 3.2617 3.2188 4.7161 3.3024 1.3353 1.4160 4.5752 3.8896 1.1183 1.1182 1.6364 1.3891 1.3669 4.1224 3.5460 2.5565 2.5895 1.7200 1.7472 1.3673 1.3676 2.2389 1.4000 1.3301 2.1151 2.7795 2.8170 2.7915 2.0690 2.0953 1.7070 2.3005 2.6862 2.3080 2.2468 2.1396 2.1017 1.4827 1.4396 2.1595 3.2527 1.0957 1.0959 1.2425 2.1896 1.9344 4.2636 2.3033 2.1755 1.1393 1.1393 1.5061 1.5002 1.6051 1.5502 1.2994 1.7062 1.2744 2.4159 1.5538 1.5692 1.5709 1.3806 1.3806 1.9430 1.8449 1.8182 1.9021 2.4463 2.4392 1.0830 1.0826 1.0407 1.0406 1.1237 1.1457 1.5738 1.5887 1.2297 1.2383 1.2119 1.2127 5.6215 5.7343 6.4084 6.3467 6.3821 6.3821 1.0709 1.0706 1.0682 1.0675 1.0554 1.0554 1.0361 1.0361 1.1074 1.1074 1.0923 1.0923 1.0882 1.0907 1.0875 1.0897 1.0989 1.0989 1.1014 1.1014 1.0853 1.0853 1.0903 1.0903 1.0938 1.0938 1.0984 1.0984
irintensity: 0.3787 0.0154 0.2104 0.0000 0.0000 0.0000 2.8388 0.0000 8.4539 0.0000 2.6771 0.8795 0.0000 0.0000 0.0000 17.5855 15.3616 0.0000 10.3002 24.5813 0.0000 8.0143 0.0000 7.5956 0.0000 15.7951 0.0000 11.8409 0.0000 32.9746 0.0000 0.0000 24.9407 0.0000 19.0783 0.0000 0.0000 8.6315 0.0000 0.5527 0.0000 4.8071 0.0000 5.6821 0.0000 104.3784 0.0000 2.9924 0.0000 45.7449 0.0048 183.0288 0.0000 4.1053 2.2116 0.2270 0.0000 0.0489 0.0000 20.3631 0.0000 89.9808 0.0000 0.0000 49.4463 0.0019 11.4628 102.4337 37.2355 0.0206 219.3563 0.0000 134.1651 0.0007 27.8025 0.0004 8.6981 0.0000 238.2310 0.0000 113.1513 0.0000 222.0777 0.0018 9.0215 0.0000 65.9707 33.2256 0.0003 0.0000 157.7531 0.0000 0.0000 273.8741 0.0000 0.1053 0.0026 81.5642 36.5764 0.0000 3.6277 0.0000 111.2666 0.0000 0.0000 49.1907 0.0000 183.0958 0.0000 1.6673 9.7651 0.0000 61.3220 0.0001 0.0001 95.5535 25.3017 0.0000 26.2070 0.0119 101.7257 0.0000 0.0001 107.1491 0.0020 17.8588 0.0084 5.0009 272.7579 0.0000 36.6661 0.0004 55.5414 0.0006 54.4618 0.0000 0.0000 221.5845 117.3196 0.1525 21.3134 24.2627 3.2638 66.7364 54.1191 0.0117 0.0232 17.2987 91.1509 0.0006 72.2670 0.0033 7.3340 65.1373 0.6263 0.0338 35.5743 2.9016 0.0686 47.3697 54.7181 0.0029
temp: 298.150 k
press: 1.00000 atm
elementType: 8 8 7 7 7 7 6 6 6 6 6 6 6 6 6 6 6 6 6 6 6 6 6 6 6 6 6 6 1 1 1 1 1 1 1 1 1 1 1 1 1 1 1 1 1 1 1 1 1 1 1 1 1 1 1 1
symmnumber: 1
zpe: 1214991.6 jmol-1
zpe.correction: 0.462766 hartree
zpe.thermalcorrener: 0.490279 hartree
zpe.thermalcorrenthalpy: 0.491223 hartree
zpe.thermalcorrgfe: 0.401683 hartree
zpe.sumelectzpe: -1222.423472 hartree
zpe.sumelectthermal: -1222.395959 hartree
zpe.sumelectthermalent: -1222.395015 hartree
zpe.sumelectthermalfe: -1222.484554 hartree
dipole: 0.0000 0.0000 0.0000
dipole: 0.0000
quadrupole: -126.4584 -149.8066 -173.8317
quadrupole: 29.4668 -1.4165 0.9620
quadrupole: 23.5738 0.2256 -23.7995 29.4668 -1.4165 0.9620
hfenergy: -1222.8862378 hartree
pointgroup: C01 [X(C22H28N4O2)]
dipole: -0.0000029 -0.0000004 -0.0000092 debye
polarizability: 553.7819238|13.9526136|309.0457798|6.6864817|17.536315|145.0527661 unknown
InChI: InChI=1S/C22H28N4O2/c1-3-27-21-11-7-5-9-19(21)17-23-25-13-15-26(16-14-25)24-18-20-10-6-8-12-22(20)28-4-2/h5-12,17-18H,3-4,13-16H2,1-2H3
charge 0 multiplicity 1
56 atoms
O  -5.890233 1.665702 -0.045525
O  5.87756 -1.681386 -0.34316
N  -1.377278 -0.368257 -0.341559
N  1.364603 0.352567 -0.047127
N  -2.674745 -0.851879 -0.320579
N  2.662069 0.83619 -0.068105
C  -1.031837 1.031226 0.001446
C  -0.396543 -1.371854 0.116065
C  0.383867 1.356164 -0.504752
C  1.019162 -1.046916 -0.390133
C  -3.71428 -0.033687 -0.257738
C  3.701605 0.017999 -0.130945
C  -5.07606 -0.580459 -0.315423
C  5.063384 0.564772 -0.073255
C  -6.200099 0.300138 -0.204157
C  6.187425 -0.315823 -0.184522
C  -5.332407 -1.969036 -0.47831
C  5.319729 1.953349 0.089639
C  -7.522857 -0.20037 -0.253221
C  7.510182 0.184686 -0.135452
C  -6.647234 -2.47358 -0.526722
C  6.634556 2.457894 0.138057
C  -7.743596 -1.587191 -0.413861
C  7.73092 1.571506 0.025194
C  -7.005137 2.622358 0.077355
C  6.992464 -2.63804 -0.466057
C  -6.384177 4.007869 0.237477
C  6.371506 -4.02355 -0.626187
H  -1.739114 1.717448 -0.496341
H  -1.10424 1.194205 1.100959
H  -0.379995 -1.416518 1.228377
H  -0.72818 -2.352402 -0.262028
H  0.715504 2.336713 -0.12666
H  0.36732 1.400827 -1.617064
H  1.091564 -1.209894 -1.489646
H  1.726438 -1.733137 0.107654
H  -3.637419 1.058828 -0.163716
H  3.624745 -1.074516 -0.22497
H  -4.467761 -2.634262 -0.566479
H  4.455083 2.618574 0.177809
H  -8.379961 0.473504 -0.167191
H  8.367287 -0.489188 -0.221482
H  -6.819068 -3.547919 -0.652892
H  6.806389 3.532232 0.264232
H  -8.770051 -1.968881 -0.45109
H  8.757374 1.953197 0.062428
H  -7.625273 2.355696 0.957944
H  -7.640165 2.569838 -0.831081
H  7.6275 -2.585527 0.442374
H  7.612593 -2.371368 -1.346649
H  -5.74738 4.047876 1.13785
H  -7.177937 4.770551 0.336221
H  -5.764281 4.260925 -0.639747
H  7.165266 -4.78623 -0.72494
H  5.751614 -4.276613 0.251039
H  5.734703 -4.063552 -1.526557
