program: Gaussian 09
title: 000268373
version: EM64L-G09RevD.01
frameworkgroup: C1[X(C18H18N6O4)]
method: RPBEPBE
basis: SDD
operation: Freq
keyword: #p
keyword: freq=noraman
keyword: PBEPBE/SDD
title: #p freq=noraman PBEPBE/SDD
converged: YES YES NO NO
title: Mulliken charges:
elementType: O O O O N N N N N N C C C C C C C C C C C C C C C C C C H H H H H H H H H H H H H H H H H H
charge: -0.220579 -0.220579 -0.219312 -0.219312 -0.108659 -0.108659 -0.006096 -0.006096 0.023262 0.023262 -0.356775 -0.357028 -0.357028 -0.356775 -0.377411 -0.377411 0.467802 0.467802 -0.374294 -0.374294 -0.354982 -0.354982 -0.360056 -0.360056 -0.355683 -0.355684 0.377567 0.377567 0.227236 0.250816 0.221902 0.242201 0.242201 0.221902 0.250816 0.227236 0.207378 0.207377 0.230775 0.230775 0.272182 0.272181 0.285497 0.285497 0.284257 0.284258
chargesum: 0.00000
title: Mulliken charges with hydrogens summed into heavy atoms:
elementType: O O O O N N N N N N C C C C C C C C C C C C C C C C C C
charge: -0.220579 -0.220579 -0.219312 -0.219312 -0.108659 -0.108659 -0.006096 -0.006096 0.023262 0.023262 0.121277 0.107076 0.107075 0.121277 -0.170033 -0.170034 0.467802 0.467802 -0.143519 -0.143519 -0.082800 -0.082800 -0.074559 -0.074559 -0.071426 -0.071426 0.377567 0.377567
polarizability: 7.84858590e+02 -6.31646391e-01 2.45840085e+02 1.18930764e+01 1.60887754e+00 1.12108731e+02
1716.lowfreq: -8.1552 -3.4168 -0.0013 -0.0004 0.0015 1.4423 8.5870 20.1590 26.4731
frequency: 8.5870 20.1590 26.4731 32.7325 45.5803 57.1179 57.1277 73.5331 74.8592 85.0206 121.6103 136.4141 159.6609 172.8892 206.5278 207.0361 228.3673 238.3970 288.7992 292.8974 314.1262 315.4752 323.7828 343.1240 356.3255 382.8106 415.0821 415.1563 436.5818 456.7836 476.1867 494.9385 504.1051 504.8983 518.4547 533.3414 539.8002 609.4613 626.3375 626.8352 659.5567 666.0609 667.3076 668.2691 741.2459 741.3055 747.7262 767.7542 784.3194 791.6694 827.5297 839.4411 839.5184 862.3458 863.9893 867.3569 871.9602 897.6933 898.0557 968.5204 983.9714 988.2362 988.2537 999.0159 999.1942 1006.7231 1006.7348 1021.7605 1044.0840 1058.7503 1094.3050 1094.7233 1107.0535 1109.7915 1131.8022 1149.3619 1152.8141 1173.2872 1173.7496 1195.6401 1218.3612 1221.4589 1227.0161 1238.9367 1245.3209 1274.3499 1290.7617 1295.9125 1296.9738 1308.1628 1340.6155 1344.4207 1351.5166 1354.3795 1360.1725 1368.0757 1379.2847 1382.2743 1411.0134 1411.8457 1426.3006 1426.4836 1455.0372 1458.2925 1464.3345 1469.0549 1482.5494 1482.8255 1551.1730 1555.1929 1585.2232 1585.8196 1610.3201 1610.9742 2941.5148 2943.2586 2952.4763 2955.6861 3032.6745 3032.6929 3068.3614 3068.4132 3095.2746 3095.7699 3132.4643 3132.4737 3163.7786 3163.7828 3181.8036 3181.8079 3185.3978 3185.4017
redmass: 8.5389 7.8378 5.9325 7.7443 4.4245 6.5007 7.3892 6.1316 5.2795 5.5947 8.6463 6.0064 4.8276 5.1183 2.4292 7.3317 6.5545 3.4297 4.1930 4.1739 3.2977 3.0685 3.1589 5.5900 3.8955 5.8304 2.9516 2.9538 6.7150 3.2495 6.1365 6.2061 3.1761 3.4189 5.7443 6.2960 5.0249 2.7285 6.9424 7.1170 6.9515 4.3754 4.7896 4.3117 4.3168 4.3116 5.6789 5.2427 7.4048 5.0597 1.6570 1.3444 1.3391 1.9166 1.4242 2.3160 3.4033 1.6805 1.6808 2.2644 2.3452 1.3548 1.3551 2.9873 2.9657 1.3437 1.3437 2.4433 1.6931 2.4166 3.2943 3.2530 1.4177 1.3324 2.1055 2.3418 3.5584 1.4136 1.3792 1.1153 4.2204 4.7001 5.1813 2.0546 1.8624 1.3738 1.5712 1.3543 1.3328 1.3244 1.3530 1.9483 3.5514 2.4694 1.7679 1.6317 3.3594 2.7216 3.1544 3.1246 4.5187 4.5046 1.0831 1.0842 1.1067 1.0916 2.7224 2.6678 5.5896 5.9706 6.8849 6.7884 6.4226 6.3908 1.0707 1.0707 1.0672 1.0670 1.0868 1.0869 1.0929 1.0929 1.0928 1.0926 1.0902 1.0902 1.0886 1.0886 1.0945 1.0945 1.0966 1.0966
irintensity: 3.0193 2.8565 0.5809 0.0000 0.0000 0.0002 0.9196 0.0015 0.0000 0.0000 0.0000 4.4571 14.7270 0.0000 15.3701 0.0000 19.7453 50.5671 4.8004 0.0000 0.0000 16.9103 0.0000 36.4963 0.0000 0.0000 0.0000 0.1055 3.0122 0.0000 18.9376 0.0000 28.9594 0.0000 2.2712 0.0000 0.0000 115.9793 1.3693 0.0000 0.0000 38.4611 0.0000 61.5214 0.0000 2.0197 0.0000 48.9307 0.0000 45.5515 0.0000 12.2592 0.0013 10.0404 0.0000 18.3141 0.0000 0.0001 161.1713 143.4209 350.1443 0.0019 0.8892 0.0000 3.9175 0.0000 0.1693 0.0000 3.3095 0.0000 113.3866 0.0002 146.3938 0.0000 765.5177 0.0000 155.2692 472.5684 0.0001 0.0000 1501.9980 0.0001 0.0000 16.9206 0.0000 58.7768 82.4910 0.0000 9.1956 0.0000 0.0000 57.2875 0.0000 141.9698 0.0000 355.6792 0.0000 98.7149 100.2738 0.0000 77.3182 0.0000 43.3155 0.0000 117.3151 0.0000 0.0000 5.4573 941.1595 0.0000 148.1009 0.0000 217.5030 0.0000 43.6468 0.0000 0.0000 198.9565 1.8401 103.1103 41.2961 0.0111 20.3314 0.0015 1.9767 22.3165 1.2995 1.4339 0.6264 0.8691 1.6485 0.6949
temp: 298.150 k
press: 1.00000 atm
elementType: 8 8 8 8 7 7 7 7 7 7 6 6 6 6 6 6 6 6 6 6 6 6 6 6 6 6 6 6 1 1 1 1 1 1 1 1 1 1 1 1 1 1 1 1 1 1
symmnumber: 1
zpe: 910213.1 jmol-1
zpe.correction: 0.346682 hartree
zpe.thermalcorrener: 0.371334 hartree
zpe.thermalcorrenthalpy: 0.372278 hartree
zpe.thermalcorrgfe: 0.287775 hartree
zpe.sumelectzpe: -1323.873800 hartree
zpe.sumelectthermal: -1323.849148 hartree
zpe.sumelectthermalent: -1323.848203 hartree
zpe.sumelectthermalfe: -1323.932707 hartree
dipole: 0.0000 0.0000 0.0003
dipole: 0.0003
quadrupole: -376.0222 -146.7356 -164.2896
quadrupole: -23.3268 -2.7270 -0.3384
quadrupole: -147.0064 82.2802 64.7262 -23.3268 -2.7270 -0.3384
hfenergy: -1324.2204817 hartree
pointgroup: C01 [X(C18H18N6O4)]
dipole: -0.0000003 0.0000355 -0.0001033 debye
polarizability: 784.4343906|3.1146088|234.5216707|-20.3775488|37.2210497|123.8513437 unknown
InChI: InChI=1S/C18H18N6O4/c25-23(26)17-5-1-15(2-6-17)13-19-21-9-11-22(12-10-21)20-14-16-3-7-18(8-4-16)24(27)28/h1-8,13-14H,9-12H2
charge 0 multiplicity 1
46 atoms
O  10.108742 0.699169 0.01859
O  -10.108252 -0.703374 -0.046402
O  9.7044 -1.445624 -0.653396
O  -9.703911 1.441419 0.625586
N  1.418134 -0.07838 0.002043
N  -1.417648 0.074216 -0.029968
N  2.769276 -0.288423 -0.036898
N  -2.76879 0.284257 0.008976
N  9.306525 -0.275971 -0.267017
N  -9.306039 0.271803 0.239091
C  0.62124 -1.316514 0.090224
C  0.761376 1.137755 0.538485
C  -0.76089 -1.141919 -0.56641
C  -0.620754 1.31235 -0.118148
C  3.646175 0.67235 0.221257
C  -3.645688 -0.676517 -0.249177
C  5.079525 0.403581 0.088767
C  -5.079038 -0.407748 -0.116688
C  6.0122 1.440376 0.389496
C  -6.011713 -1.444544 -0.417418
C  5.578552 -0.867185 -0.332767
C  -5.578066 0.863017 0.304846
C  7.395916 1.226856 0.276808
C  -7.395429 -1.231024 -0.304731
C  6.956705 -1.093896 -0.44856
C  -6.956219 1.089728 0.420638
C  7.8559 -0.042121 -0.142669
C  -7.855413 0.037953 0.114745
H  0.482734 -1.605778 1.154568
H  1.192006 -2.111983 -0.414103
H  1.370197 2.025948 0.298999
H  0.663293 1.067195 1.643644
H  -0.662806 -1.071359 -1.671569
H  -1.369711 -2.030112 -0.326925
H  -1.191521 2.107819 0.38618
H  -0.482249 1.601615 -1.182492
H  3.364942 1.692124 0.534807
H  -3.364454 -1.696291 -0.562728
H  5.643294 2.42079 0.713657
H  -5.642806 -2.424957 -0.741579
H  4.860648 -1.658785 -0.564827
H  -4.860162 1.654618 0.536907
H  8.122528 2.0116 0.502786
H  -8.12204 -2.015768 -0.53071
H  7.357545 -2.058944 -0.769799
H  -7.357059 2.054775 0.741877
