program: Gaussian 09
title: 000268374
version: EM64L-G09RevD.01
frameworkgroup: C1[X(C20H20N4O4)]
method: RPBEPBE
basis: SDD
operation: Freq
keyword: #p
keyword: freq=noraman
keyword: PBEPBE/SDD
title: #p freq=noraman PBEPBE/SDD
converged: NO YES NO NO
title: Mulliken charges:
elementType: O O O O N N N N C C C C C C C C C C C C C C C C C C C C H H H H H H H H H H H H H H H H H H H H
charge: -0.445215 -0.445215 -0.257434 -0.257434 -0.108749 -0.108749 -0.010081 -0.010080 -0.359330 -0.357736 -0.357736 -0.359330 -0.379483 -0.379483 0.456681 0.456681 -0.389708 -0.389708 -0.371779 -0.371779 -0.332278 -0.332278 -0.352202 -0.352202 0.258272 0.258271 0.106266 0.106266 0.247298 0.222715 0.237239 0.218966 0.237239 0.218967 0.247298 0.222714 0.202674 0.202674 0.223207 0.223207 0.267326 0.267326 0.273058 0.273058 0.268578 0.268578 0.381717 0.381717
chargesum: 0.00000
title: Mulliken charges with hydrogens summed into heavy atoms:
elementType: O O O O N N N N C C C C C C C C C C C C C C C C C C C C
charge: -0.063498 -0.063498 -0.257434 -0.257434 -0.108749 -0.108749 -0.010081 -0.010080 0.110683 0.098469 0.098469 0.110682 -0.176809 -0.176809 0.456681 0.456681 -0.166501 -0.166501 -0.104454 -0.104454 -0.059220 -0.059220 -0.083624 -0.083624 0.258272 0.258271 0.106266 0.106266
polarizability: 7.18533543e+02 2.78424662e-01 2.42433756e+02 -8.32372843e+00 -1.74995691e+00 1.16387445e+02
1716.lowfreq: -4.7672 -0.0012 0.0010 0.0016 1.4516 7.3232 8.8256 20.6926 27.2711
frequency: 8.8256 20.6926 27.2711 33.4844 47.1615 56.3805 56.5443 79.1407 79.7091 87.6841 119.7789 131.9653 155.6424 167.9370 185.5133 201.4851 211.6692 234.5979 279.9728 284.2745 306.1750 308.0844 318.7553 338.7481 349.7325 375.7056 411.4561 411.4764 415.4918 454.7791 469.3589 473.7748 503.5469 506.0328 508.3384 526.0035 534.2518 580.8682 586.4750 586.5596 611.2791 630.6866 631.3844 638.2012 689.0837 689.2114 721.2507 730.2794 764.3126 764.4513 765.6144 785.3394 828.7836 844.9216 845.0322 865.1457 870.7112 873.4655 874.3081 899.9989 900.3609 969.5092 982.5117 987.6189 987.6382 996.7994 998.0258 1009.0781 1009.0927 1017.0339 1017.2644 1021.4896 1045.9307 1060.6797 1112.7532 1116.8855 1129.3229 1144.8839 1150.1002 1151.2760 1155.1219 1189.2755 1190.3975 1195.8518 1227.6497 1238.0876 1244.8359 1274.7031 1289.3318 1300.7922 1302.9530 1307.4710 1320.9540 1321.7050 1340.7461 1346.3026 1358.6309 1361.7541 1368.2508 1376.5284 1398.3196 1399.1900 1424.1086 1424.2024 1455.1174 1458.3032 1464.2140 1469.1045 1500.5703 1500.6569 1549.0358 1551.0612 1570.8945 1573.0541 1619.1769 1619.8454 1638.5570 1638.9462 2933.7906 2935.8317 2945.0836 2948.5649 3026.3338 3026.3616 3063.4479 3063.5275 3091.7227 3092.2688 3123.6249 3123.6352 3149.3765 3149.3824 3170.4396 3170.4425 3175.9937 3176.0013 3534.2113 3534.2386
redmass: 7.5291 7.1695 5.4659 6.8368 4.0115 6.2498 6.3744 6.0403 5.1300 5.4480 8.0997 6.1074 4.7623 4.9510 5.9702 2.6712 4.4938 3.3225 4.0263 4.3077 3.1045 2.9585 3.0916 5.0096 4.1955 4.4644 2.9122 2.9285 5.9604 3.5506 6.2448 5.4420 3.6844 2.8562 3.4584 6.2806 4.2879 3.6051 1.2363 1.2591 5.0032 7.0237 7.0944 2.4081 3.6679 3.6659 4.9206 4.3626 4.1602 4.0694 5.2287 3.8989 1.6458 1.4047 1.3940 3.7147 2.1594 1.4338 1.8298 1.6960 1.6959 2.2742 2.4047 1.3796 1.3799 4.8276 4.4129 1.3543 1.3543 2.6722 2.6183 2.5537 1.6992 2.3927 1.6782 1.4095 1.8433 2.2421 1.8214 1.6515 2.8393 1.2057 1.2059 1.1233 4.8679 2.0071 1.8393 1.3960 1.5541 1.4098 1.4080 1.3412 2.5313 2.5413 1.2945 1.5403 1.5802 1.6865 3.8161 2.2826 2.2007 2.2027 4.4198 4.4262 1.0822 1.0840 1.0945 1.0919 2.8210 2.8100 6.4161 6.8563 5.8695 5.7829 6.3358 6.3159 8.3858 8.4040 1.0708 1.0707 1.0675 1.0672 1.0866 1.0866 1.0925 1.0925 1.0922 1.0921 1.0897 1.0897 1.0882 1.0882 1.0960 1.0960 1.0953 1.0953 1.0641 1.0641
irintensity: 0.4966 0.6930 1.8191 0.0000 0.0000 0.9828 0.0000 0.4154 0.0000 0.0000 0.0000 1.8577 6.4239 0.0000 0.0000 6.7398 29.2353 59.8685 0.3595 0.0000 0.0000 10.6440 0.0000 53.4389 0.0000 0.0000 0.0000 1.0325 52.0936 0.0000 17.6679 0.0000 42.7979 0.0000 60.5985 0.0000 0.0000 153.7978 0.0253 151.1028 0.0000 1.2263 0.0000 39.9595 0.0001 157.9392 0.0000 54.2257 0.0000 16.9201 0.0000 6.8185 0.0000 10.0864 0.0001 14.0857 0.0000 12.1995 0.0000 0.0004 154.3986 193.1248 589.5146 0.0000 0.1202 0.0000 283.5105 0.0035 1.0339 400.6924 0.0012 0.0000 3.2985 0.0000 160.6382 0.0000 678.4939 0.0000 343.5315 0.0000 1.8181 0.0000 9.9265 0.0000 0.0000 16.3430 0.0000 80.6813 88.5679 0.0000 42.7944 0.0000 425.4159 0.0001 0.0000 14.7010 0.0000 331.5954 0.0000 84.1062 101.8363 0.0000 65.6891 0.0005 39.8197 0.0000 109.2500 0.0000 0.0002 16.1727 404.5209 0.0000 624.6895 0.0000 252.9353 0.0001 733.3207 0.0019 47.4700 0.0001 0.0002 213.0442 0.6981 113.7617 46.7429 0.0442 23.6410 0.0002 0.8707 31.5372 0.4249 0.2237 1.7017 8.9209 2.7089 0.1179 128.0518 0.4409
temp: 298.150 k
press: 1.00000 atm
elementType: 8 8 8 8 7 7 7 7 6 6 6 6 6 6 6 6 6 6 6 6 6 6 6 6 6 6 6 6 1 1 1 1 1 1 1 1 1 1 1 1 1 1 1 1 1 1 1 1
symmnumber: 1
zpe: 974759.4 jmol-1
zpe.correction: 0.371266 hartree
zpe.thermalcorrener: 0.396522 hartree
zpe.thermalcorrenthalpy: 0.397466 hartree
zpe.thermalcorrgfe: 0.312155 hartree
zpe.sumelectzpe: -1291.977978 hartree
zpe.sumelectthermal: -1291.952722 hartree
zpe.sumelectthermalent: -1291.951778 hartree
zpe.sumelectthermalfe: -1292.037089 hartree
dipole: 0.0000 0.0000 0.0000
dipole: 0.0000
quadrupole: -223.6015 -154.8574 -167.7503
quadrupole: -41.0359 1.7671 0.5699
quadrupole: -41.5318 27.2123 14.3194 -41.0359 1.7671 0.5699
hfenergy: -1292.3492439 hartree
pointgroup: C01 [X(C20H20N4O4)]
dipole: -0.0000084 -0.0000031 -0.000008 debye
polarizability: 718.2504241|3.7830029|231.7066044|-15.0113587|35.1735689|127.3977144 unknown
InChI: InChI=1S/C20H20N4O4/c25-19(26)17-5-1-15(2-6-17)13-21-23-9-11-24(12-10-23)22-14-16-3-7-18(8-4-16)20(27)28/h1-8,13-14,25,27H,9-12H2
charge 0 multiplicity 1
48 atoms
O  10.140664 0.80945 0.094628
O  -10.14072 -0.810383 -0.100952
O  9.865747 -1.387417 -0.607889
O  -9.865795 1.386483 0.601563
N  1.419026 -0.0721 -0.033402
N  -1.41908 0.071157 0.02702
N  2.774418 -0.2884 -0.060463
N  -2.774472 0.287458 0.054086
C  0.627016 -1.311657 0.078826
C  0.773758 1.138008 0.529052
C  -0.773812 -1.138951 -0.535433
C  -0.62707 1.310713 -0.085207
C  3.649415 0.669575 0.207756
C  -3.649471 -0.670514 -0.214133
C  5.086888 0.406016 0.087025
C  -5.086943 -0.406953 -0.093393
C  6.011996 1.44483 0.399163
C  -6.012055 -1.445764 -0.405529
C  5.596825 -0.860008 -0.33339
C  -5.596876 0.85907 0.32703
C  7.39827 1.23391 0.298203
C  -7.398328 -1.234842 -0.304561
C  6.978563 -1.072431 -0.433932
C  -6.978613 1.071495 0.42758
C  7.894527 -0.028558 -0.119961
C  -7.894581 0.027625 0.11361
C  9.34451 -0.302737 -0.244627
C  -9.344563 0.301807 0.238283
H  1.183776 -2.106076 -0.442925
H  0.520263 -1.603333 1.146826
H  0.708726 1.063384 1.637115
H  1.372182 2.029556 0.274951
H  -0.70878 -1.064328 -1.643496
H  -1.372236 -2.030498 -0.281331
H  -1.18383 2.105133 0.436543
H  -0.520315 1.60239 -1.153208
H  3.365006 1.688981 0.52143
H  -3.365066 -1.689921 -0.527809
H  5.634355 2.422878 0.722364
H  -5.634418 -2.423812 -0.728736
H  4.885386 -1.654898 -0.575367
H  -4.885434 1.653958 0.569005
H  8.106044 2.032289 0.537485
H  -8.106105 -2.033218 -0.543842
H  7.380705 -2.038875 -0.755762
H  -7.380751 2.03794 0.749415
H  11.095563 0.55301 -0.011497
H  -11.095618 -0.553945 0.005189
