program: Gaussian 09
title: 000268477
version: EM64L-G09RevD.01
frameworkgroup: C1[X(C23H18Cl3NO4)]
method: RPBEPBE
basis: SDD
operation: Freq
keyword: #p
keyword: freq=noraman
keyword: PBEPBE/SDD
title: #p freq=noraman PBEPBE/SDD
converged: YES YES NO NO
title: Mulliken charges:
elementType: Cl Cl Cl O O O O N C C C C C C C C C C C C C C C C C C C C C C C H H H H H H H H H H H H H H H H H H
charge: 0.008183 0.008328 0.014684 -0.327692 -0.284201 -0.173493 -0.303233 -0.389683 -0.187804 -0.612915 0.487182 0.193012 -0.412176 -0.389063 0.303327 -0.250306 -0.230481 -0.243774 -0.475774 0.591818 0.463692 -0.324680 -0.287272 -0.384984 -0.374026 -0.076229 -0.196493 -0.226991 -0.229195 -0.101329 -0.233334 0.300155 0.270637 0.247180 0.370628 0.252720 0.248950 0.236436 0.230708 0.233553 0.245552 0.223241 0.302313 0.234542 0.272693 0.286422 0.228315 0.229921 0.230936
chargesum: 0.00000
title: Mulliken charges with hydrogens summed into heavy atoms:
elementType: Cl Cl Cl O O O O N C C C C C C C C C C C C C C C C C C C C C C C
charge: 0.008183 0.008328 0.014684 -0.327692 -0.284201 -0.173493 -0.303233 -0.019055 0.112351 -0.095097 0.487182 0.193012 -0.159455 -0.140114 0.303327 -0.013870 0.000226 -0.010222 -0.006980 0.591818 0.463692 -0.324680 0.015040 -0.150442 -0.101333 -0.076229 0.089929 0.001324 0.000726 -0.101329 -0.002398
polarizability: 3.43426097e+02 -4.39916707e+00 2.91366067e+02 8.36673715e+00 -2.70784160e+01 2.23409024e+02
1716.lowfreq: -3.2147 -2.3644 -0.0004 0.0008 0.0016 6.2462 8.4218 12.9982 16.1779
frequency: 7.5172 12.9579 15.8613 19.4816 21.6113 36.4665 38.8076 49.7495 55.8761 64.8366 75.3311 84.3250 94.3292 113.8660 147.1054 150.5431 156.9550 176.3267 181.7854 202.0527 229.7599 235.5081 247.2851 275.6200 296.4915 311.0484 338.5017 351.1041 362.1447 381.1789 398.0712 403.0452 405.5870 422.0955 449.1123 476.9284 484.3405 494.1784 519.0058 552.8229 572.8640 576.5655 589.7728 594.1962 616.9906 617.8407 629.6978 650.8468 664.6349 679.8930 698.8189 704.1524 708.2973 716.3586 744.3293 755.5872 760.5388 785.7219 815.6364 825.4079 856.8390 858.5281 861.5740 863.4583 891.1996 898.5900 908.7871 930.1889 936.0777 954.4912 963.9263 982.4290 983.3350 988.9386 989.2508 993.4945 999.8132 1001.6762 1027.1826 1027.4841 1033.1179 1078.5925 1091.4648 1104.6571 1117.5349 1126.9810 1173.0963 1173.7048 1187.0875 1189.4831 1191.7127 1199.1514 1207.6750 1221.7685 1223.0319 1230.6222 1237.3759 1243.7312 1310.2325 1329.9543 1331.1292 1332.6372 1341.9482 1351.2496 1363.1376 1381.3015 1385.0442 1439.8384 1441.7261 1442.0914 1462.8619 1470.5958 1473.2860 1484.6428 1485.2497 1566.7081 1579.6672 1590.5325 1594.0973 1612.7338 1614.2489 1642.8723 1688.7184 3013.2494 3026.6448 3038.6999 3079.2277 3112.3398 3118.1549 3120.5230 3125.5593 3128.5373 3136.3891 3140.4217 3146.8749 3151.0869 3164.1120 3165.2247 3169.5189 3183.1793 3570.7950
redmass: 7.6526 5.5642 8.2497 7.4186 5.3327 6.2072 7.4013 7.5822 5.0813 9.4683 7.4581 9.9888 9.0188 5.8470 7.1906 7.2351 6.6497 9.1581 12.9680 11.8881 7.0960 5.5890 7.5564 11.4509 7.0544 23.2509 5.5389 2.8877 3.4126 5.2657 4.7702 2.8727 2.8547 3.3328 3.2314 6.7801 4.1749 4.6294 5.3175 5.2542 3.0522 2.3657 2.8907 4.7145 6.3354 6.2201 4.6404 6.6527 6.2937 4.2097 4.9581 2.3971 2.9823 2.3075 4.1021 2.7852 2.2586 4.3476 3.4599 3.4790 1.4583 1.3725 1.3044 3.6093 2.4853 2.1729 3.5495 1.5555 1.4918 2.3701 2.3198 1.4938 1.3904 3.9408 6.0089 4.1112 1.3159 1.3277 2.2228 2.2399 6.9123 1.7196 1.5207 2.0022 2.9839 2.2731 1.0567 1.0540 1.5897 1.1375 1.1503 2.1543 3.6266 2.8444 1.8045 1.2331 1.1595 1.4527 1.5659 6.1331 1.2654 1.3345 1.3274 1.3180 10.9315 7.4927 8.0778 2.7638 2.3633 2.1719 1.1746 1.1253 1.9524 2.2810 2.2765 10.5125 7.9089 5.9549 6.0814 6.0663 6.0551 9.4718 11.9054 1.0628 1.0806 1.0586 1.1039 1.1074 1.0869 1.0866 1.0867 1.0873 1.0919 1.0921 1.0961 1.0964 1.1013 1.1016 1.0939 1.0932 1.0779
irintensity: 0.0154 0.1103 0.0832 0.0061 0.0115 0.3297 0.0628 0.1196 1.1567 0.4852 1.8295 7.5061 0.8162 0.0634 0.3568 0.7932 0.9629 0.2275 0.1573 0.7825 0.6648 0.2686 13.8812 1.0352 7.2933 0.3311 1.5522 7.9643 1.3499 7.0839 16.1548 0.4172 0.2043 0.6723 13.4947 5.8723 14.7399 14.3031 4.1649 15.7813 50.4555 42.4810 58.5848 3.9948 0.5581 0.3587 11.9984 8.3118 14.9796 2.2643 26.9235 54.6017 37.8944 62.4635 7.6161 26.6036 63.1916 20.4345 11.2809 27.6186 7.7339 4.7630 11.9138 36.9971 25.0195 34.4462 31.7108 7.8062 5.3922 138.1978 54.5096 8.8705 1.3399 49.9332 0.1239 118.3766 2.6833 0.9727 1.4089 9.8790 146.7224 130.0517 8.5778 209.7571 97.2200 43.3294 0.7868 0.0521 37.2951 12.7199 11.2982 126.4054 48.1966 23.3297 21.1564 2.5141 9.8169 23.7187 65.9483 30.9535 1.5857 0.9678 14.0417 8.7680 4.7529 1.6351 0.6633 170.7115 73.7942 9.9123 16.2510 16.7237 535.7318 7.8712 36.5548 0.1988 3.3934 0.5933 2.4249 4.1803 0.7424 264.3771 131.5798 11.4913 12.1483 37.5069 5.7370 4.9042 3.1313 5.0592 1.1043 1.5404 11.3772 17.5426 31.4993 24.0312 15.5530 21.8753 15.3381 1.1131 83.6006
temp: 298.150 k
press: 1.00000 atm
elementType: 17 17 17 8 8 8 8 7 6 6 6 6 6 6 6 6 6 6 6 6 6 6 6 6 6 6 6 6 6 6 6 1 1 1 1 1 1 1 1 1 1 1 1 1 1 1 1 1 1
symmnumber: 1
zpe: 934898.7 jmol-1
zpe.correction: 0.356084 hartree
zpe.thermalcorrener: 0.384990 hartree
zpe.thermalcorrenthalpy: 0.385935 hartree
zpe.thermalcorrgfe: 0.288738 hartree
zpe.sumelectzpe: -2620.885937 hartree
zpe.sumelectthermal: -2620.857030 hartree
zpe.sumelectthermalent: -2620.856086 hartree
zpe.sumelectthermalfe: -2620.953283 hartree
dipole: 1.5051 1.3765 -2.1312
dipole: 2.9499
quadrupole: -197.9570 -193.8928 -199.3043
quadrupole: 9.2671 -6.3507 3.2887
quadrupole: -0.9056 3.1586 -2.2529 9.2671 -6.3507 3.2887
hfenergy: -2621.2420208 hartree
pointgroup: C01 [X(C23H18Cl3N1O4)]
dipole: -0.5570946 0.0696968 -1.0157484 debye
polarizability: 343.0420352|10.6906322|237.7421776|-9.9963595|37.4476944|277.4169753 unknown
InChI: InChI=1S/C23H18Cl3NO4/c24-17-12-19(26)21(13-18(17)25)31-22(28)20(11-15-7-3-1-4-8-15)27-23(29)30-14-16-9-5-2-6-10-16/h1-10,12-13,20,27H,11,14H2
charge 0 multiplicity 1
49 atoms
Cl 2.916376 2.956801 2.463278
Cl 5.742411 -0.62152 -2.065568
Cl 7.409645 1.779124 -0.546744
O  1.633302 0.690594 0.816724
O  -2.770839 1.722012 0.374557
O  2.115947 -0.570949 2.738153
O  -2.991373 0.292142 2.248026
N  -0.952388 0.59419 1.138377
C  -0.22317 -0.324267 2.011231
C  -0.510297 -1.845816 1.695125
C  -0.025138 -2.284667 0.324744
C  1.280735 -0.093013 1.958158
C  1.249841 -2.891838 0.172293
C  -0.818478 -2.070255 -0.833167
C  -2.29327 0.816491 1.335724
C  1.726461 -3.264961 -1.105418
C  -0.343702 -2.440381 -2.1121
C  0.931635 -3.036024 -2.25339
C  -4.256047 1.960974 0.402268
C  3.008669 0.921053 0.547923
C  -4.99099 0.969017 -0.473532
C  3.722081 1.950008 1.199153
C  3.631052 0.141799 -0.444493
C  -5.256707 1.270537 -1.833518
C  -5.419594 -0.276921 0.055231
C  4.972899 0.395222 -0.786927
C  5.064017 2.20364 0.86162
C  -5.934181 0.342976 -2.656155
C  -6.095971 -1.205546 -0.766739
C  5.688326 1.424263 -0.134687
C  -6.354876 -0.898097 -2.123574
H  -0.549874 -0.158101 3.055115
H  -1.603025 -1.96802 1.798761
H  -0.024892 -2.437452 2.491905
H  -0.469368 1.039899 0.357313
H  1.866969 -3.079578 1.059855
H  -1.814432 -1.622796 -0.732137
H  2.706854 -3.744969 -1.20372
H  -0.970599 -2.271059 -2.994708
H  1.296645 -3.329405 -3.244015
H  -4.586538 1.903519 1.453434
H  -4.344884 2.99122 0.023839
H  3.062004 -0.653481 -0.934667
H  -4.930754 2.23285 -2.247434
H  -5.209726 -0.510494 1.105182
H  5.620429 2.998793 1.363518
H  -6.137514 0.587109 -3.704837
H  -6.424981 -2.164178 -0.35028
H  -6.883589 -1.617445 -2.759198
