program: Gaussian 09
title: 000268338
version: EM64L-G09RevD.01
frameworkgroup: C1[X(C9H6BrNO)]
method: RPBEPBE
basis: SDD
operation: Freq
keyword: #p
keyword: freq=noraman
keyword: PBEPBE/SDD
title: #p freq=noraman PBEPBE/SDD
converged: NO YES NO YES
title: Mulliken charges:
elementType: Br O N C C C C C C C C C H H H H H H
charge: 0.062172 -0.231953 -0.433159 0.281028 0.351940 -0.178511 -0.368566 -0.379428 0.132397 -0.314107 -0.205378 -0.259958 0.337459 0.259166 0.235906 0.238915 0.235328 0.236750
chargesum: 0.00000
title: Mulliken charges with hydrogens summed into heavy atoms:
elementType: Br O N C C C C C C C C C
charge: 0.062172 -0.231953 -0.095701 0.281028 0.351940 0.080655 -0.132660 -0.140513 0.132397 -0.314107 0.029950 -0.023208
polarizability: 2.21124478e+02 -1.36864283e+01 1.21839571e+02 -1.69482102e-03 9.32142760e-03 4.44076996e+01
1716.lowfreq: -2.0712 -0.0005 -0.0005 0.0003 10.5504 11.2341 79.5752 110.7073 158.8802
frequency: 79.5307 110.7050 158.8786 235.1218 240.1688 295.5439 309.8534 384.3146 433.3325 461.5570 549.6975 554.6473 573.9812 610.2769 681.2781 714.9055 743.1659 758.7748 770.8719 789.7091 861.0490 905.0379 911.8238 952.4794 967.6640 985.5264 1030.1402 1131.3529 1171.5488 1188.3338 1241.0921 1253.6105 1283.6134 1341.7175 1391.3614 1418.9238 1454.7195 1489.3912 1553.7946 1598.7609 1619.5840 1637.6288 3129.5218 3136.1371 3149.0494 3151.9934 3172.0652 3507.5741
redmass: 6.0303 6.8695 9.7156 4.4540 18.1420 5.8705 6.3126 3.4632 8.2254 2.8441 6.3475 3.4924 7.6208 7.0417 1.7295 7.1260 2.7029 1.7303 2.0351 5.0235 1.4227 5.5596 1.4340 1.4111 4.6167 1.3329 2.1801 1.5548 1.3725 1.8314 2.2396 1.5313 2.5124 1.9492 2.6278 3.7177 3.2007 2.8645 6.9682 5.7855 7.2025 6.0692 1.0874 1.0891 1.0927 1.0943 1.1003 1.0766
irintensity: 1.4897 1.0942 0.5168 0.9825 0.3840 0.5760 2.4697 7.1602 6.0070 18.6330 8.0794 0.1890 24.4508 5.8000 9.4362 5.2737 11.3259 25.1766 140.1520 18.5468 10.9698 0.7837 14.7583 10.7639 77.5243 0.0031 4.9218 12.4432 2.5630 21.4984 17.2775 13.2005 4.2738 0.6607 3.3041 16.6382 12.4139 9.2974 27.4531 47.3780 29.2627 400.9825 5.0183 0.7536 2.8473 20.1768 22.4332 36.4762
temp: 298.150 k
press: 1.00000 atm
elementType: 35 8 7 6 6 6 6 6 6 6 6 6 1 1 1 1 1 1
symmnumber: 1
zpe: 335503.5 jmol-1
zpe.correction: 0.127787 hartree
zpe.thermalcorrener: 0.137196 hartree
zpe.thermalcorrenthalpy: 0.138140 hartree
zpe.thermalcorrgfe: 0.091826 hartree
zpe.sumelectzpe: -489.187011 hartree
zpe.sumelectthermal: -489.177602 hartree
zpe.sumelectthermalent: -489.176658 hartree
zpe.sumelectthermalfe: -489.222972 hartree
dipole: 5.4469 -1.9528 0.0002
dipole: 5.7864
quadrupole: -71.9830 -73.0731 -82.1561
quadrupole: 8.8062 -0.0002 0.0025
quadrupole: 3.7544 2.6643 -6.4187 8.8062 -0.0002 0.0025
hfenergy: -489.314798 hartree
pointgroup: C01 [X(C9H6Br1N1O1)]
dipole: 2.2537565 0.3212039 -0.0000813 debye
dipolederiv: -0.6127673 0.2069134 0.000026 0.3622975 -0.1315437 -0.0000385 0.0000819 -0.0000438 0.0108971 -1.074412 -0.3604968 -0.0002553 -0.6389176 -0.7442738 -0.0001652 0.0003335 0.0001865 -0.3604927 -0.9500244 -0.3804726 0.000021 0.1851353 -0.3161889 -0.0000288 -0.0000781 -0.0000381 -0.2909951 0.462369 0.3975254 0.0000738 0.2226479 0.1931325 0.0000433 0.0000441 0.0000752 0.1134001 -0.2639139 -0.0140177 -0.0000336 -0.0964982 -0.1465638 -0.0000118 -0.0000022 -0.0000198 0.0185927 0.150787 0.1168491 0.0000843 0.0056528 0.1180065 0.0000474 0.0000161 -0.0000122 -0.0532491 -0.1299314 -0.1910208 -0.0000113 -0.017387 0.0865821 0.0000298 -0.0000129 -0.000035 -0.1949462 0.2768611 -0.0382976 0.0000332 0.1336583 0.1244047 0.0000294 0.0000552 0.0000383 -0.1409769 1.2674283 0.6230629 0.0002253 0.6358326 0.9023417 0.0001796 -0.000188 -0.0000743 0.2457954 0.8688157 -0.5249217 -0.0001257 -0.9569137 -0.1521933 0.000004 -0.000167 -0.0000277 -0.1593052 -0.0391427 0.0325013 0.0000209 -0.2129518 0.1493667 0.0000063 -0.0000122 0.0000302 -0.1310383 -0.1696674 0.1144693 0.0000175 0.3161187 -0.1210377 0.0000277 0.0000405 0.00001 -0.1787112 0.1058184 0.0364156 -0.0000277 0.01849 0.1808982 -0.0000051 -0.0000164 0.0000186 0.3191394 0.0880951 -0.0224205 0.000002 0.037777 -0.0449804 -0.0000411 -0.0000289 -0.0000327 0.1452953 0.0787918 -0.0409862 -0.0000113 0.0212506 -0.0984797 -0.0000267 -0.0000078 -0.0000365 0.1726033 0.0907855 0.0458023 -0.0000012 -0.0121697 -0.0855426 -0.0000263 -0.000011 -0.0000268 0.1547906 -0.0754179 0.0822336 -0.000011 0.0857743 0.0498579 -0.0000026 -0.0000164 0.0000115 0.1585765 -0.0744748 -0.0831391 -0.0000267 -0.089797 0.0362137 -0.0000215 -0.0000304 -0.0000234 0.1706244 unknown
polarizability: 222.4987899|-6.9986541|120.4652594|0.0035364|0.0087895|44.4076996 unknown
InChI: InChI=1S/C9H6BrNO/c10-7-5-6-3-1-2-4-8(6)11-9(7)12/h1-5,11H
charge 0 multiplicity 1
18 atoms
Br -3.584252 1.467048 0.000181
O  -2.841501 -1.62069 -0.000068
N  -0.521506 -1.40324 -0.000324
C  0.680554 -0.692856 -0.000119
C  0.618901 0.739141 0.000015
C  -0.684366 1.37026 0.000066
C  1.93631 -1.35613 -0.000049
C  1.834164 1.481436 0.000207
C  -1.832287 -0.859981 -0.000575
C  -1.838909 0.6203 -0.000102
C  3.120249 -0.598434 0.000115
C  3.074318 0.823766 0.000242
H  -0.499399 -2.428567 -0.000334
H  -0.739483 2.464089 0.000317
H  1.978277 -2.451696 -0.000143
H  1.786173 2.576462 0.00033
H  4.088219 -1.110785 0.000155
H  4.004939 1.399575 0.000384
