program: Gaussian 09
title: 000268335
version: EM64L-G09RevD.01
frameworkgroup: C1[X(C12H13N)]
method: RPBEPBE
basis: SDD
operation: Freq
keyword: #pfreq=noraman
keyword: PBEPBE/SDD
title: #p freq=noraman PBEPBE/SDD
converged: YES YES NO NO
title: Mulliken charges:
elementType: N C C C C C C C C C C C C H H H H H H H H H H H H H
charge: -0.020834 0.294435 0.263945 -0.548006 0.308225 -0.053356 -0.383208 -0.544522 -0.687996 -0.841836 -0.310180 -0.267516 -0.229655 0.218083 0.229346 0.231895 0.243889 0.221569 0.221540 0.235348 0.232015 0.233075 0.237062 0.260509 0.225667 0.230505
chargesum: 0.00000
title: Mulliken charges with hydrogens summed into heavy atoms:
elementType: N C C C C C C C C C C C C
charge: -0.020834 0.294435 0.263945 -0.100577 0.308225 -0.053356 -0.151313 -0.300632 -0.009539 -0.139684 -0.049671 -0.041849 0.000850
polarizability: 1.91032903e+02 1.28108434e+01 1.47744850e+02 3.38820786e+00 -6.82226277e+00 7.04393840e+01
1716.lowfreq: -13.7485 -8.2916 -0.0007 -0.0003 0.0003 8.4657 71.8538 90.7437 112.6554
frequency: 71.7654 90.7183 112.6540 144.0594 183.1144 206.8690 252.4237 283.7272 337.0941 345.6004 432.6079 442.6219 472.1077 503.2912 506.8037 553.1230 601.4644 661.3156 680.8756 724.6006 771.2270 784.6929 803.0988 824.9444 880.1028 901.0318 922.3067 961.7865 966.6131 994.9200 1000.6327 1023.2640 1036.1991 1058.9132 1085.9804 1101.9001 1149.9493 1177.6702 1211.5978 1246.1774 1255.4395 1277.4716 1313.3744 1332.5420 1376.1804 1379.7680 1392.5343 1402.7972 1429.6017 1453.4355 1465.7429 1471.8001 1474.7837 1484.6816 1499.2111 1509.4573 1560.0762 1577.3445 1619.8927 2973.5880 2982.9313 3003.1398 3049.6722 3052.2901 3080.0857 3080.6675 3087.5556 3100.5558 3127.0742 3141.0682 3155.9037 3170.6092
redmass: 2.6266 3.5243 3.3347 1.0592 3.3861 1.0731 3.4222 3.2542 2.2686 4.3800 3.6985 4.1885 3.4668 3.1924 4.5419 5.5675 3.6390 4.8196 3.7761 4.3221 1.3507 1.3305 2.7746 4.5548 1.7670 2.6671 1.3530 2.2513 1.4667 1.3249 1.5173 2.1483 1.6043 2.1655 2.3091 1.7364 1.4846 1.3162 2.8516 1.4517 1.7454 1.6926 1.4424 4.4022 1.8915 2.9042 1.3098 1.2636 3.9629 2.5045 1.2560 1.0458 1.0467 1.0570 1.3183 1.8657 6.9535 7.0488 6.3437 1.0377 1.0350 1.0617 1.0984 1.0982 1.0992 1.0996 1.1007 1.0909 1.0850 1.0893 1.0955 1.0995
irintensity: 0.0381 0.5960 2.5017 0.0311 0.2933 0.0356 0.6379 1.5116 0.2150 0.8427 5.3124 3.2599 3.0937 0.1117 0.4957 1.4873 0.5615 1.0417 4.5899 6.0833 81.7815 9.2011 0.4977 2.1872 0.4583 6.0555 9.1914 1.0132 1.7901 0.5215 7.1973 8.1308 9.0559 12.3794 0.3389 2.0045 5.3101 2.5297 1.2750 0.3901 5.1243 4.4996 1.1901 3.4630 17.9425 3.3298 14.0527 10.7510 0.9010 4.4740 2.7331 12.5312 13.6434 4.7014 20.2851 32.2519 5.8907 11.2986 0.9772 34.9714 34.5240 28.1663 12.6084 11.2420 49.6221 11.8327 39.8830 38.9001 0.6324 12.9865 28.1797 22.7699
temp: 298.150 k
press: 1.00000 atm
elementType: 7 6 6 6 6 6 6 6 6 6 6 6 6 1 1 1 1 1 1 1 1 1 1 1 1 1
symmnumber: 1
zpe: 566976.8 jmol-1
zpe.correction: 0.215950 hartree
zpe.thermalcorrener: 0.227415 hartree
zpe.thermalcorrenthalpy: 0.228359 hartree
zpe.thermalcorrgfe: 0.178834 hartree
zpe.sumelectzpe: -518.910594 hartree
zpe.sumelectthermal: -518.899130 hartree
zpe.sumelectthermalent: -518.898185 hartree
zpe.sumelectthermalfe: -518.947710 hartree
dipole: -1.7865 2.5926 -0.3880
dipole: 3.1723
quadrupole: -65.6721 -77.3268 -81.1603
quadrupole: 3.7012 0.5966 -0.5965
quadrupole: 9.0476 -2.6071 -6.4405 3.7012 0.5966 -0.5965
hfenergy: -519.1265445 hartree
pointgroup: C01 [X(C12H13N1)]
dipole: 0.6778208 -1.0384324 -0.1411774 debye
dipolederiv: -0.4326306 0.0680875 0.0127938 0.0540343 -0.3140999 -0.0003723 0.0218667 -0.0146244 -0.2474431 0.1002719 -0.069362 0.0158904 -0.2430373 0.3414593 0.0173124 -0.03635 0.0493333 -0.0901966 -0.0740239 0.0845126 0.008516 0.1877223 -0.185398 -0.0295051 0.0338935 -0.0373752 0.0396399 0.074452 0.0520757 -0.0076178 0.0819265 -0.0425894 0.0417089 -0.0688211 0.1215178 0.0566937 0.3192353 0.0575477 -0.0284464 -0.0266192 -0.40413 -0.0240303 -0.035605 -0.0757179 0.0047417 0.2096741 0.1496763 0.0147157 0.0016191 0.0202615 -0.0045056 -0.0101501 -0.0145504 0.0507666 -0.0698603 -0.0332758 -0.0067592 -0.03165 0.065051 0.0187064 -0.0069555 0.0325321 -0.1548396 0.0916939 -0.1117718 -0.0221672 0.1079187 0.4365853 0.0499557 0.0044932 0.0793397 -0.0728493 0.0472695 0.0171412 -0.0092675 0.0247475 0.0395783 0.030315 0.0555937 -0.0473211 0.0092631 -0.1564239 -0.0216637 0.0175661 0.0851702 0.1072869 0.0079101 0.0528837 0.0265558 0.0584366 -0.0120155 -0.0559895 -0.0179849 -0.0925364 0.085478 0.0392024 -0.0243206 0.0344207 -0.1416132 -0.072188 0.0499032 -0.0035863 0.0750468 0.142739 0.0397808 0.0016681 0.0361622 -0.1541771 0.1121797 -0.0700624 -0.0301966 -0.0892648 -0.0979707 0.0127807 -0.0330953 0.0143397 -0.1592497 0.028876 -0.0817282 -0.1159286 -0.0210595 -0.0301944 -0.0733544 -0.0641639 -0.0581341 -0.0253066 -0.1089818 0.0178681 0.1065066 -0.0325129 0.0586629 0.0561955 0.07439 0.0234731 0.011449 0.0637914 0.0929516 0.0217612 0.0532251 -0.0835781 -0.0254047 0.0156519 -0.0344547 0.1344315 -0.0259155 -0.1274727 -0.0073307 -0.109008 -0.0654176 -0.0138777 -0.009267 -0.0177504 0.1152325 0.0143696 -0.0486459 -0.0959418 -0.1095288 0.0195204 -0.0963577 -0.066169 -0.0503489 -0.0149086 0.0166879 0.1347948 0.00356 0.1569419 -0.159326 0.0016546 0.000207 -0.0020763 0.0620896 -0.0730253 -0.0669767 0.1115059 -0.0319602 0.0855536 0.0277931 0.0709595 0.0105142 0.0284665 0.0679642 -0.012025 -0.002455 -0.1410565 -0.1253129 -0.0346077 -0.0277223 -0.048239 0.1021712 -0.0294009 0.0331806 -0.0384228 0.0852018 0.0189772 0.1042178 -0.0969834 0.079551 0.0012548 -0.0149071 -0.0092742 0.0448824 0.0266975 0.0839276 -0.0817708 0.1074711 -0.0461745 -0.07877 0.0613779 0.0341518 0.0108379 0.0935441 -0.0257702 -0.0309188 0.0201416 -0.0279218 0.1519281 0.0060095 -0.0979529 -0.0045421 -0.1154346 -0.062018 -0.0231975 -0.0039179 -0.0239238 0.155211 -0.1444802 0.0143099 0.0221106 0.0098723 0.0907244 -0.0096311 0.0243009 -0.0091273 0.157578 unknown
polarizability: 191.5393125|11.7833199|147.3798735|-4.429994|5.5325915|70.2979506 unknown
InChI: InChI=1S/C12H13N/c1-3-10-9(2)8-13-12-7-5-4-6-11(10)12/h4-8H,3H2,1-2H3
charge 0 multiplicity 1
26 atoms
N  -0.283363 2.129161 0.198945
C  1.074777 -0.380599 -0.25778
C  -0.366909 -0.335874 -0.142177
C  1.798113 -1.703225 -0.459834
C  1.790818 0.828125 -0.134387
C  -1.005035 0.946854 0.084146
C  -1.205787 -1.497376 -0.239017
C  1.053087 2.040255 0.091328
C  2.037395 -2.453679 0.881034
C  3.303677 0.905911 -0.234402
C  -2.429818 1.02565 0.1978
C  -2.594498 -1.394836 -0.123061
C  -3.214843 -0.124265 0.096351
H  1.224661 -2.355831 -1.14384
H  2.772728 -1.526431 -0.948101
H  -0.755066 -2.481186 -0.406567
H  1.604909 2.985377 0.186722
H  2.646085 -1.843413 1.572526
H  2.568225 -3.407127 0.706507
H  1.0818 -2.67717 1.387631
H  3.653947 1.933937 -0.037518
H  3.803049 0.237666 0.491447
H  3.663896 0.620419 -1.241308
H  -2.865904 2.015338 0.365515
H  -3.21612 -2.293841 -0.201482
H  -4.304926 -0.058843 0.183622
