program: Gaussian 09
title: 000268329
version: EM64L-G09RevD.01
frameworkgroup: C1[X(C12H13NO)]
method: RPBEPBE
basis: SDD
operation: Freq
keyword: #p
keyword: freq=noraman
keyword: PBEPBE/SDD
title: #p freq=noraman PBEPBE/SDD
converged: NO YES NO YES
title: Mulliken charges:
elementType: O N C C C C C C C C C C C C H H H H H H H H H H H H H
charge: -0.269310 -0.420527 0.256549 0.110335 0.368841 0.371034 -0.624431 0.476187 -0.564387 -0.457284 0.046847 -0.847645 -0.812661 -0.821003 0.247744 0.237488 0.345371 0.249060 0.235044 0.235037 0.241452 0.236356 0.237975 0.236338 0.225260 0.230170 0.230160
chargesum: 0.00000
title: Mulliken charges with hydrogens summed into heavy atoms:
elementType: O N C C C C C C C C C C C C
charge: -0.269310 -0.075155 0.256549 0.110335 0.368841 0.371034 -0.376686 0.476187 -0.326899 -0.208224 0.046847 -0.136113 -0.101992 -0.135414
polarizability: 2.12757802e+02 3.61934446e+00 1.56969117e+02 -5.86834512e-05 -3.66686590e-04 6.99230877e+01
1716.lowfreq: -9.9166 -0.0007 -0.0005 0.0004 6.6941 11.0720 63.2178 73.7486 128.2853
frequency: 63.2095 73.7452 128.2841 168.9790 172.3442 199.3981 203.0666 204.3501 222.7634 259.8256 311.6483 367.0124 370.9437 423.6148 451.5827 494.2312 529.2054 537.0639 564.2939 570.6438 592.4017 621.7912 670.8102 736.5471 775.3687 835.5940 869.4530 881.2004 901.1763 908.5882 937.0418 969.2774 992.7962 1018.8583 1025.4136 1044.6279 1048.1223 1051.5293 1137.7597 1197.8084 1228.4627 1267.6394 1284.6887 1289.2888 1364.9499 1386.0600 1397.9217 1398.3883 1403.4747 1421.4164 1438.6178 1459.1372 1468.0542 1469.8767 1471.9120 1477.5101 1483.5296 1495.0648 1567.5872 1602.8698 1626.3231 1655.8421 2961.0060 2974.3447 2978.4501 3031.2000 3051.6114 3055.1061 3082.3570 3090.4962 3098.6483 3114.4988 3143.0244 3168.0062 3521.2551
redmass: 1.9104 1.4738 3.7660 1.4786 1.4226 2.2874 1.9626 3.5786 2.2051 2.7709 3.1485 5.2867 4.6583 5.2531 3.5170 4.8667 5.1466 4.3292 2.9236 4.7793 2.6919 4.2366 2.1553 1.7474 4.1676 4.3911 1.4189 1.4028 4.9629 1.3796 2.9929 4.6289 1.6937 1.5458 1.4328 1.5084 1.5668 1.5597 2.2529 2.0977 2.0256 1.7983 2.6054 2.5683 2.9978 1.9767 1.2378 1.2592 1.5781 3.1899 2.5927 2.6702 1.0456 1.0459 1.1484 1.0436 1.2297 1.3921 6.4913 5.3501 6.0141 5.9349 1.0396 1.0372 1.0379 1.0978 1.0977 1.0971 1.0987 1.0958 1.0983 1.0915 1.0911 1.0924 1.0761
irintensity: 0.5179 2.4043 0.5832 0.1565 4.9613 2.5027 0.3548 0.2881 0.0235 1.3322 1.2132 3.5248 0.9725 5.0226 0.0231 0.0236 7.3013 0.8712 5.1159 9.6790 0.4865 1.9154 34.6167 40.3432 15.6269 3.2390 0.0070 49.4384 2.4574 2.5332 6.7949 0.1867 7.7604 1.5174 6.8477 0.0469 4.7612 19.0216 9.3796 2.4190 5.1362 2.9605 29.2034 12.9846 36.5201 23.6172 18.0467 6.4644 23.7260 3.2724 54.8944 18.3425 22.4892 7.2639 3.1796 13.7676 15.5672 17.3066 26.0537 81.3552 51.8311 459.6738 29.7636 43.9670 18.3885 18.5932 20.3368 16.5595 16.7604 12.8434 21.8045 20.8720 11.0007 4.1247 31.5090
temp: 298.150 k
press: 1.00000 atm
elementType: 8 7 6 6 6 6 6 6 6 6 6 6 6 6 1 1 1 1 1 1 1 1 1 1 1 1 1
symmnumber: 1
zpe: 576964.9 jmol-1
zpe.correction: 0.219754 hartree
zpe.thermalcorrener: 0.232767 hartree
zpe.thermalcorrenthalpy: 0.233711 hartree
zpe.thermalcorrgfe: 0.180897 hartree
zpe.sumelectzpe: -594.091152 hartree
zpe.sumelectthermal: -594.078140 hartree
zpe.sumelectthermalent: -594.077195 hartree
zpe.sumelectthermalfe: -594.130009 hartree
dipole: 5.2407 0.9553 0.0005
dipole: 5.3271
quadrupole: -97.1043 -68.8838 -86.0116
quadrupole: -7.8691 -0.0007 -0.0014
quadrupole: -13.1044 15.1161 -2.0117 -7.8691 -0.0007 -0.0014
hfenergy: -594.3109063 hartree
pointgroup: C01 [X(C12H13N1O1)]
dipole: -2.0472189 -0.448842 -0.0021263 debye
polarizability: 212.4287143|5.5949963|157.2824392|0.4873101|-1.0892746|69.9388529 unknown
InChI: InChI=1S/C12H13NO/c1-7-4-9(3)12-10(5-7)8(2)6-11(14)13-12/h4-6,13H,1-3H3
charge 0 multiplicity 1
27 atoms
O  3.679086 1.156964 -0.000216
N  1.349012 1.260964 -0.01077
C  -0.054625 -0.728959 0.009096
C  0.070296 0.697836 -0.008603
C  -1.088334 1.537219 -0.023784
C  1.165213 -1.539072 0.024187
C  -1.361691 -1.296252 0.011179
C  -2.51682 -0.495498 -0.003488
C  -2.352134 0.921076 -0.02087
C  2.399729 -0.915549 0.021134
C  2.567169 0.538705 0.003269
C  -0.94545 3.048038 -0.042413
C  1.068906 -3.051297 0.043099
C  -3.907882 -1.105094 -0.001156
H  -1.468713 -2.386289 0.02439
H  -3.246459 1.557826 -0.032421
H  1.455268 2.279544 -0.023021
H  3.328977 -1.492746 0.032165
H  -0.404422 3.424248 0.848807
H  -0.396985 3.401532 -0.938378
H  -1.934533 3.534238 -0.052708
H  0.520674 -3.407304 0.935797
H  2.071373 -3.508781 0.052738
H  0.527349 -3.430037 -0.844295
H  -3.864357 -2.207637 0.012761
H  -4.489821 -0.780629 0.882272
H  -4.483127 -0.802849 -0.896773
