program: Gaussian 09
title: 000268327
version: EM64L-G09RevD.01
frameworkgroup: C1[X(C11H10BrNO)]
method: RPBEPBE
basis: SDD
operation: Freq
keyword: #p
keyword: freq=noraman
keyword: PBEPBE/SDD
title: #p freq=noraman PBEPBE/SDD
converged: NO YES NO NO
title: Mulliken charges:
elementType: Br O N C C C C C C C C C C C H H H H H H H H H H
charge: 0.007179 -0.265306 -0.420207 0.261423 0.264779 0.291572 0.136700 -0.028434 -0.299372 -0.791338 -0.379816 -0.812412 -0.291442 -0.185876 0.332145 0.240198 0.241630 0.233398 0.241658 0.239657 0.222888 0.283930 0.222923 0.254121
chargesum: 0.00000
title: Mulliken charges with hydrogens summed into heavy atoms:
elementType: Br O N C C C C C C C C C C C
charge: 0.007179 -0.265306 -0.088062 0.261423 0.264779 0.291572 0.136700 -0.028434 -0.059174 -0.074651 -0.140159 -0.082671 -0.291442 0.068246
polarizability: 2.54928147e+02 4.90867614e-02 1.46282871e+02 -9.90826739e-03 -9.29654455e-03 6.25695779e+01
1716.lowfreq: -114.0416 -12.0653 -3.6211 -0.0008 -0.0006 -0.0003 7.9874 56.0151 102.0091
frequency: -114.0052 56.0027 102.0009 109.0479 131.8061 151.5806 161.1964 236.3764 296.2948 309.7848 340.8789 344.5247 353.5622 432.5814 446.2392 481.5581 522.5325 531.4839 591.4253 603.9437 665.1424 688.4055 703.6629 743.6174 767.1804 818.9974 830.7731 869.4035 879.8005 946.9193 968.0874 1015.4961 1049.0792 1051.5932 1071.2900 1104.2515 1130.4068 1174.0017 1257.3821 1269.2905 1274.0585 1336.0896 1377.6007 1392.9711 1402.0429 1405.3719 1436.9859 1457.0907 1464.4053 1464.6042 1483.9261 1496.9309 1547.6589 1587.8444 1602.4786 1628.3467 2970.9339 2984.9712 3041.3703 3054.3069 3105.9801 3118.9949 3133.5680 3174.9073 3181.3639 3509.2586
redmass: 1.0176 7.3548 2.0464 1.3231 7.3389 3.3935 7.3524 15.8883 3.6347 3.0496 5.1709 3.0783 6.5539 5.4756 3.3711 6.6947 3.0482 5.9042 3.5915 4.5093 6.7633 1.8458 5.9371 2.2782 2.9525 1.5966 2.8935 4.6745 1.5692 1.3496 1.8423 1.4354 1.5940 2.6811 2.2496 2.0701 2.3817 1.7815 1.4584 5.5193 1.9799 3.2330 2.2122 1.3324 6.4913 1.2258 3.2713 1.4066 1.0511 1.2540 1.0472 1.8151 7.0600 5.8717 7.7293 5.5645 1.0386 1.0409 1.0969 1.0968 1.0970 1.0948 1.0899 1.0955 1.0909 1.0766
irintensity: 0.2749 2.9137 3.2079 0.0000 0.4314 1.0163 2.4181 1.3118 1.9039 2.7447 0.1579 0.7717 9.2641 3.7222 4.0195 18.9899 15.9546 1.1912 1.3767 11.8353 2.3685 23.4950 2.4716 30.0146 12.9319 85.0701 22.5873 19.3277 9.8115 1.3168 12.6395 4.3504 0.0033 20.7991 12.3433 14.2940 22.7771 35.0213 22.6718 1.3946 4.3526 41.7131 59.3258 3.0865 26.9948 27.1222 0.9168 6.5695 3.1142 18.6790 34.0222 62.6417 6.3757 82.9296 109.3600 392.0482 32.4287 11.1837 28.0573 4.3104 3.3997 17.0790 7.6881 4.2676 1.7542 35.3423
temp: 298.150 k
press: 1.00000 atm
elementType: 35 8 7 6 6 6 6 6 6 6 6 6 6 6 1 1 1 1 1 1 1 1 1 1
symmnumber: 1
zpe: 477559.2 jmol-1
zpe.correction: 0.181893 hartree
zpe.thermalcorrener: 0.194091 hartree
zpe.thermalcorrenthalpy: 0.195036 hartree
zpe.thermalcorrgfe: 0.142486 hartree
zpe.sumelectzpe: -567.648681 hartree
zpe.sumelectthermal: -567.636482 hartree
zpe.sumelectthermalent: -567.635538 hartree
zpe.sumelectthermalfe: -567.688087 hartree
dipole: -1.5037 0.8840 0.0015
dipole: 1.7443
quadrupole: -114.5104 -76.6311 -94.4233
quadrupole: 11.7120 0.0031 -0.0015
quadrupole: -19.3221 18.5572 0.7649 11.7120 0.0031 -0.0015
hfenergy: -567.8305733 hartree
pointgroup: C01 [X(C11H10Br1N1O1)]
dipole: 0.5551628 0.4033577 0.0065678 debye
dipolederiv: -0.6937965 -0.189291 -0.0004485 -0.30313 -0.1536553 -0.0010956 -0.0035847 -0.0019299 -0.0350658 -1.3793277 -0.2928369 -0.0005042 -0.6377541 -0.7217269 -0.0048189 -0.0101687 -0.0075119 -0.3746006 -1.1516262 -0.2239714 0.0003039 0.1961771 -0.2877873 -0.0018529 0.0123534 0.0012222 -0.2781559 -0.1267393 -0.02977 0.0002165 -0.066288 -0.1779026 -0.004516 -0.0008543 -0.0047853 0.0034869 0.2284972 0.1092168 0.0010582 -0.152252 0.4645925 0.0147152 -0.0062088 0.0126772 -0.0259366 0.5756603 0.3669982 0.0068215 0.3753144 0.0843483 -0.0033929 0.0069564 -0.0033486 0.1046304 0.0374913 -0.3030381 -0.0092319 -0.6644588 -0.3385139 -0.002542 -0.0192923 -0.0053808 -0.0636398 1.7041351 0.3226828 -0.0026873 0.6142759 0.834645 0.0136244 0.0052998 0.0159202 0.1823433 -0.1339533 -0.0734957 -0.0016906 -0.1086126 0.0056955 0.0030967 -0.0027154 0.0028152 -0.0755556 0.0574006 0.0809669 0.0020135 0.0503804 -0.2250476 -0.007575 0.001121 -0.0077713 0.0352784 -0.0023267 -0.1372966 -0.0053024 -0.0293755 0.0861834 0.0079677 -0.002245 0.0086944 -0.187824 -0.1252843 0.0374718 0.0024804 0.2289329 -0.0798873 -0.0058428 0.0078098 -0.0043468 0.0659521 1.0547755 0.4338045 0.0032654 0.8130206 0.0919467 0.0009255 0.013903 0.003787 -0.1560917 -0.4299134 -0.0834908 0.0002632 -0.2681207 0.0557776 0.0059074 -0.004977 0.0045159 -0.0797972 0.1291379 0.033897 0.0023652 0.0372821 0.1706042 -0.0042676 0.0024905 -0.0041455 0.3126203 0.1354952 -0.0121753 -0.0002675 -0.0337598 -0.0412054 -0.0049625 -0.0008691 -0.0050932 0.143596 0.0349137 0.049977 -0.10047 0.012259 0.0285016 0.0324573 -0.0749942 0.0823941 -0.0194889 -0.0877864 -0.136576 -0.0020913 -0.0582638 0.0766929 -0.0003903 0.0000468 0.0002486 0.1077851 0.0378245 0.0430157 0.101949 0.0076671 0.0346066 -0.0296865 0.0745443 -0.080161 -0.0285546 0.0418866 -0.0733051 -0.0010994 -0.0211934 -0.0869662 -0.007112 0.0003824 -0.0066651 0.1704875 0.0335379 0.0143174 0.0285571 0.0606217 0.0021754 0.1132863 -0.0447847 0.1165268 -0.0346901 0.0271225 -0.0277889 -0.0000829 -0.1767032 0.1006412 0.0007521 -0.0042687 -0.0003578 0.1206466 0.0337713 0.014215 -0.0288055 0.0563718 0.0150094 -0.1113508 0.0469468 -0.1138992 -0.0477096 -0.000896 0.076473 0.0033876 0.067609 0.0612723 -0.0033268 0.0031087 -0.0034051 0.1602838 unknown
polarizability: 253.9108661|10.4444145|147.2264937|-1.1487762|2.306638|62.6432352 unknown
InChI: InChI=1S/C11H10BrNO/c1-6-7(2)11(14)13-10-4-3-8(12)5-9(6)10/h3-5,13H,1-2H3
charge 0 multiplicity 1
24 atoms
Br 4.604224 0.931712 -0.020551
O  -3.320248 -1.559547 -0.030915
N  -1.000263 -1.622792 -0.050796
C  0.376634 0.382235 -0.004515
C  -0.851598 1.181665 0.027072
C  0.267191 -1.049147 -0.044238
C  -2.09627 0.554628 0.019132
C  -2.221536 -0.91748 -0.021345
C  1.68787 0.943696 0.001584
C  -0.805805 2.698757 0.068378
C  1.426202 -1.869744 -0.076252
C  -3.397716 1.323812 0.050367
C  2.817492 0.116825 -0.030255
C  2.706663 -1.294524 -0.069566
H  -1.094295 -2.643258 -0.078561
H  1.822422 2.026607 0.031058
H  -1.336776 3.127862 -0.802242
H  0.214356 3.108155 0.071054
H  -1.32201 3.079493 0.969831
H  1.321417 -2.96058 -0.106229
H  -3.491383 2.001929 -0.819817
H  -4.241871 0.616596 0.036747
H  -3.478182 1.95196 0.958558
H  3.600182 -1.924158 -0.094197
