program: Gaussian 09
title: 000268583
version: EM64L-G09RevD.01
frameworkgroup: C1[X(C25H25Cl2N3O4)]
method: RPBEPBE
basis: SDD
operation: Freq
keyword: #p
keyword: freq=noraman
keyword: PBEPBE/SDD
title: #p freq=noraman PBEPBE/SDD
converged: YES YES NO NO
title: Mulliken charges:
elementType: Cl Cl O O O O N N N C C C C C C C C C C C C C C C C C C C C C C C C C H H H H H H H H H H H H H H H H H H H H H H H H H
charge: -0.071722 -0.050147 -0.320852 -0.295184 -0.279106 -0.307128 -0.104105 -0.482374 -0.466707 -0.530671 -0.363976 -0.341041 0.475230 -0.304014 -0.313503 -0.451209 -0.379092 -0.219816 -0.230973 -0.241384 0.245895 0.294427 0.454473 0.481965 -0.418045 -0.427466 -0.338812 -0.318787 -0.187187 -0.181095 -0.202485 -0.195176 -0.122835 -0.127763 0.224732 0.204145 0.220447 0.209432 0.226989 0.228378 0.243000 0.224631 0.277249 0.250578 0.235094 0.254394 0.227013 0.228724 0.229996 0.398639 0.338937 0.252835 0.235103 0.301730 0.283976 0.253117 0.258530 0.251810 0.261186
chargesum: 0.00000
title: Mulliken charges with hydrogens summed into heavy atoms:
elementType: Cl Cl O O O O N N N C C C C C C C C C C C C C C C C C C C C C C C C C
charge: -0.071722 -0.050147 -0.320852 -0.295184 -0.279106 -0.307128 -0.104105 -0.083736 -0.127770 -0.101794 0.065904 0.114327 0.475230 0.163618 0.214323 -0.216115 -0.124698 0.007197 -0.002249 -0.011388 0.245895 0.294427 0.454473 0.481965 -0.165209 -0.192363 -0.037082 -0.034811 0.065930 0.077434 0.049325 0.066011 -0.122835 -0.127763
polarizability: 4.66182592e+02 -2.60050135e+00 3.42483495e+02 2.13935569e+01 1.88312224e+01 2.04837018e+02
1716.lowfreq: -3.8786 -1.7021 -0.0023 -0.0019 -0.0002 1.3303 9.4154 12.4447 17.2170
frequency: 9.3136 12.2548 17.1777 21.5180 26.5302 30.7329 41.6808 48.6805 52.7357 59.4988 69.9574 73.4506 89.4385 108.9364 112.4967 124.5725 130.2917 146.0403 157.5044 169.5245 197.7788 217.4382 234.3069 239.6959 245.1123 262.1976 283.6363 298.6866 328.0818 330.6861 338.6466 353.0373 362.8377 378.0990 386.9567 399.0364 402.5851 407.2173 411.6756 414.3132 449.2853 467.0097 493.6580 504.0141 508.5391 535.2466 595.0130 617.2205 618.4024 619.4472 642.3721 649.9591 656.8648 671.8670 682.1285 689.0417 701.1831 703.9462 706.3160 706.9529 746.7148 783.6951 794.2289 804.4729 814.0628 819.0213 819.9329 826.5718 837.7458 838.7447 859.1628 867.1199 894.9549 916.2049 924.1084 940.2252 943.6892 953.2443 955.4925 967.7863 971.3667 981.4285 985.5025 990.4906 991.7086 995.0550 999.1067 1004.8270 1019.7709 1029.0496 1063.8907 1068.8192 1072.9295 1075.9750 1080.3771 1087.6333 1114.1231 1117.0517 1151.7788 1165.8637 1171.4853 1172.2717 1182.2373 1184.4218 1185.6867 1189.5576 1212.1270 1220.9561 1250.6426 1260.1838 1272.0511 1275.3526 1291.6356 1297.3019 1299.4116 1318.4347 1324.8780 1328.3452 1341.0691 1361.8836 1370.0721 1373.3433 1377.7030 1382.9575 1397.6411 1403.0411 1404.8899 1440.3306 1442.6168 1448.6090 1454.8904 1467.3832 1471.8184 1479.5333 1482.7855 1483.9199 1512.3666 1545.8982 1594.8671 1595.7779 1604.8450 1607.6136 1610.9112 1613.7166 1640.5397 1669.6918 2869.6752 2891.9214 2966.0598 3001.6060 3016.6065 3030.5259 3036.1480 3055.0467 3104.7689 3114.7219 3122.1981 3130.0765 3134.7750 3139.3765 3145.4870 3149.3234 3161.8227 3162.5695 3164.9755 3171.2052 3173.6359 3190.4770 3196.7241 3320.1752 3540.6054
redmass: 7.5227 5.7835 9.2855 6.1516 5.7374 5.0438 5.2889 5.4507 6.4093 5.5057 7.1032 7.2623 9.2292 5.6313 3.4851 5.4653 4.7542 6.8966 5.7506 5.8883 7.7361 4.8659 3.7578 7.0383 5.7154 7.4992 4.6385 4.0255 5.0198 4.8625 4.1089 3.4075 4.8180 4.3003 4.1796 4.5944 2.8755 2.8216 3.0106 3.0604 5.2365 3.6964 4.2718 2.7521 2.8547 2.5508 4.5506 6.3311 6.9049 6.7833 1.3994 6.3687 5.3492 6.6681 6.1723 8.5338 4.1508 3.7978 2.1487 3.7346 1.6729 1.6316 2.5038 3.5575 1.4349 2.2740 1.9112 3.6859 1.4464 1.4639 1.2473 4.5662 7.0519 1.4305 1.1639 1.3575 2.7165 1.3908 2.1543 1.3440 1.3346 1.4465 2.0661 5.6306 4.7240 3.7390 1.3937 4.5884 3.7851 2.3705 2.4517 2.9508 2.6198 2.6389 1.9456 2.0541 1.3303 1.3345 3.1824 2.0051 1.0663 2.8716 1.1349 1.2000 1.3703 2.0069 2.7015 1.1656 1.2372 2.1282 1.3267 2.1102 1.2001 1.3380 1.4290 1.2855 1.2092 1.2497 1.3802 1.5521 3.4519 2.4192 1.9900 2.8307 1.7016 3.8265 3.7872 1.9430 1.1106 1.1134 1.1081 1.0970 1.1824 2.3284 2.5072 1.9757 2.4130 2.3748 6.1237 5.6834 3.5108 5.5925 6.1147 6.1190 7.6433 6.4348 1.0702 1.0698 1.0597 1.0881 1.0716 1.0781 1.0999 1.0566 1.1062 1.0872 1.0861 1.0903 1.0911 1.1109 1.0961 1.0883 1.0908 1.1014 1.0911 1.0968 1.0955 1.0954 1.0949 1.0817 1.0761
irintensity: 0.1221 0.2447 0.2406 0.1028 0.2632 0.2654 0.0481 0.3186 0.0539 0.2825 0.6078 0.6281 2.7992 4.7588 3.5908 1.0867 2.4902 1.1514 1.8493 1.5953 2.3677 2.4294 0.9096 4.3788 2.4213 2.8650 11.7196 14.9083 8.0316 9.4348 7.0056 4.6092 0.6864 14.6135 8.6533 32.8641 7.2070 3.6794 0.0358 0.1643 7.7477 7.2671 6.6600 47.0101 20.2169 6.1659 3.4986 0.0026 8.6057 1.1376 40.2556 20.9814 26.7848 11.8132 3.9805 8.7641 25.8899 3.5238 38.2152 23.6478 74.2201 32.4176 4.2140 9.8136 22.7047 29.6140 11.6564 7.3658 85.8174 24.3405 0.4889 9.6467 10.5460 10.8346 84.2570 3.0372 29.0146 19.0077 16.8138 6.0699 2.3162 13.2064 55.6018 9.4056 40.4261 69.3814 0.7406 52.7571 370.7038 107.5844 3.8213 6.3648 43.4814 71.3967 9.8562 10.8791 40.2648 7.8026 27.5165 27.8110 0.0770 85.8123 27.9747 48.2876 108.0752 528.6683 4.8484 14.6567 27.9260 6.7285 14.5536 45.8014 37.5347 23.6341 22.4078 15.0219 4.8075 4.9793 36.6067 26.8257 97.9579 23.1622 38.7709 5.6276 6.6259 23.5726 25.9329 12.0146 37.8039 5.0870 3.3786 13.0324 20.1312 25.0791 179.9557 3.4365 691.3741 431.1672 1.5820 33.5740 124.3396 22.2913 96.7633 2.2109 511.6049 132.3382 74.0159 94.1517 34.5676 16.8277 3.8946 70.1201 41.8257 21.5970 11.2317 7.9930 0.8302 10.8773 11.5917 4.7685 38.2950 2.8141 4.1726 25.5059 1.1946 1.7047 2.8023 3.7843 0.5984 672.1776 36.7110
temp: 298.150 k
press: 1.00000 atm
elementType: 17 17 8 8 8 8 7 7 7 6 6 6 6 6 6 6 6 6 6 6 6 6 6 6 6 6 6 6 6 6 6 6 6 6 1 1 1 1 1 1 1 1 1 1 1 1 1 1 1 1 1 1 1 1 1 1 1 1 1
symmnumber: 1
zpe: 1199226.2 jmol-1
zpe.correction: 0.456761 hartree
zpe.thermalcorrener: 0.488808 hartree
zpe.thermalcorrenthalpy: 0.489752 hartree
zpe.thermalcorrgfe: 0.386511 hartree
zpe.sumelectzpe: -2350.499486 hartree
zpe.sumelectthermal: -2350.467440 hartree
zpe.sumelectthermalent: -2350.466496 hartree
zpe.sumelectthermalfe: -2350.569736 hartree
dipole: -7.1229 4.4145 0.7297
dipole: 8.4117
quadrupole: -226.1806 -211.2123 -209.8328
quadrupole: 3.6642 -4.4428 5.7803
quadrupole: -10.4387 4.5296 5.9091 3.6642 -4.4428 5.7803
hfenergy: -2350.9562476 hartree
pointgroup: C01 [X(C25H25Cl2N3O4)]
dipole: -2.850402 -1.6547521 0.2986284 debye
polarizability: 458.6432024|-5.8038632|345.1130902|-48.3790682|-3.0565904|209.7468121 unknown
InChI: InChI=1S/C25H25Cl2N3O4/c26-20-6-10-22(11-7-20)28-24(31)33-16-14-30(18-19-4-2-1-3-5-19)15-17-34-25(32)29-23-12-8-21(27)9-13-23/h1-13,28-29H,14-18H2
charge 0 multiplicity 1
59 atoms
Cl 6.772979 2.994348 -2.488431
Cl 6.231645 -4.854332 0.150315
O  -0.773032 2.585602 0.864276
O  -1.306065 -1.526039 0.68442
O  0.241179 4.410756 -0.236974
O  0.781739 -0.42993 0.762846
N  -3.50296 1.472206 -0.104196
N  1.30289 2.299765 0.02682
N  0.5562 -2.759835 0.452533
C  -4.816373 1.254631 -0.765713
C  -2.982367 2.851581 -0.25132
C  -2.525192 0.381726 -0.362175
C  -5.574401 0.048382 -0.216361
C  -2.062911 3.312744 0.888684
C  -2.057197 -0.259436 0.959581
C  -6.157984 -0.898176 -1.092971
C  -5.746634 -0.11677 1.182167
C  -6.906828 -1.986657 -0.586427
C  -6.49284 -1.201175 1.691735
C  -7.076993 -2.140738 0.807858
C  0.285124 3.218239 0.161864
C  0.083455 -1.473715 0.642332
C  2.569037 2.520821 -0.576069
C  1.908324 -3.197411 0.384903
C  3.421027 1.393072 -0.730996
C  2.146374 -4.518502 -0.07868
C  3.009951 3.79745 -1.018831
C  3.002684 -2.387112 0.786144
C  4.697752 1.531653 -1.310777
C  3.458198 -5.028707 -0.148248
C  4.289129 3.935742 -1.599722
C  4.317122 -2.894786 0.710131
C  5.11751 2.806651 -1.736653
C  4.531607 -4.205489 0.244214
H  -5.423652 2.164587 -0.590989
H  -4.717895 1.145457 -1.873997
H  -2.447119 3.006877 -1.21946
H  -3.850257 3.539299 -0.250884
H  -3.003062 -0.407394 -0.973777
H  -1.646376 0.759156 -0.92325
H  -1.858627 4.395088 0.79835
H  -2.506231 3.078051 1.869767
H  -1.413302 0.42816 1.530586
H  -2.923923 -0.588814 1.551066
H  -6.0291 -0.782413 -2.176667
H  -5.285664 0.612353 1.858932
H  -7.35288 -2.711358 -1.276992
H  -6.622551 -1.314667 2.774171
H  -7.656562 -2.982818 1.202565
H  1.094456 1.346637 0.373355
H  -0.174296 -3.466863 0.34113
H  3.076089 0.405187 -0.409008
H  1.308048 -5.151947 -0.392397
H  2.353528 4.663616 -0.91532
H  2.825941 -1.378342 1.16297
H  5.348246 0.66078 -1.433695
H  3.63908 -6.046101 -0.506053
H  4.631944 4.917186 -1.94046
H  5.162019 -2.273777 1.021678
