program: Gaussian 09
title: 000268326
version: EM64L-G09RevD.01
frameworkgroup: C1[X(C11H7ClF3NO)]
method: RPBEPBE
basis: SDD
operation: Freq
keyword: #p
keyword: freq=noraman
keyword: PBEPBE/SDD
title: #p freq=noraman PBEPBE/SDD
converged: YES YES NO NO
title: Mulliken charges:
elementType: Cl F F F O N C C C C C C C C C C C H H H H H H H
charge: -0.017670 -0.157112 -0.162603 -0.162103 -0.243987 -0.419667 0.236459 0.441797 0.119695 0.402497 -0.351446 -0.376985 -0.441023 0.242683 -0.251744 0.054761 -0.825500 0.343403 0.279918 0.253909 0.270709 0.266205 0.231711 0.266093
chargesum: 0.00000
title: Mulliken charges with hydrogens summed into heavy atoms:
elementType: Cl F F F O N C C C C C C C C C C C
charge: -0.017670 -0.157112 -0.162603 -0.162103 -0.243987 -0.076264 0.236459 0.441797 0.119695 0.402497 -0.351446 -0.097067 -0.187115 0.242683 0.018965 0.054761 -0.061490
polarizability: 1.86483204e+02 -1.18104770e+01 1.88440771e+02 -4.99145392e-02 2.23935759e-02 6.39138604e+01
1716.lowfreq: -14.9748 -7.8728 -0.0027 -0.0024 -0.0021 3.4747 14.9808 57.9419 78.2175
frequency: 9.5761 57.9300 78.2023 132.0568 166.4885 166.8393 187.3262 197.8647 255.7828 258.8502 297.9167 311.3436 324.4808 353.4100 365.9696 415.6549 457.1812 478.5022 493.6274 516.7998 533.9347 541.8706 586.4557 600.3187 632.1723 650.0217 672.9833 696.9222 759.3411 783.7959 810.5580 824.9643 884.2755 904.1924 950.4480 962.7949 976.0652 992.9374 1030.6087 1051.0422 1070.3406 1111.5266 1186.2557 1220.6206 1224.4084 1280.4349 1299.6386 1351.4571 1377.6460 1394.2333 1411.4834 1418.4055 1473.2446 1478.9030 1487.1492 1545.8722 1584.0648 1594.0856 1660.7369 3018.8254 3111.7212 3115.3024 3175.6469 3179.8755 3203.0776 3474.2934
redmass: 6.0239 8.2561 5.0845 6.6711 13.0877 3.0368 17.9856 6.2006 12.9648 1.3791 5.8144 15.5780 4.9917 5.7143 7.6126 9.0570 4.4437 7.3841 6.9503 7.7811 6.9991 8.1840 3.5092 4.8099 5.7847 13.1509 2.8041 6.3896 2.3099 2.4452 7.4636 1.3564 1.4679 7.8840 1.4751 3.2505 6.8286 5.6388 3.6240 1.5539 2.2384 3.6182 2.1180 1.9786 2.4489 2.9271 2.5735 2.6997 3.5785 2.4923 1.5876 3.0467 1.0457 2.4543 1.2076 5.6338 5.9510 7.1872 5.6049 1.0367 1.0994 1.0970 1.0923 1.0908 1.0954 1.0763
irintensity: 4.0594 0.8599 0.1058 0.4078 1.3904 0.2035 0.8602 1.5171 2.6822 0.0024 7.8316 0.0535 2.9661 9.8257 0.0022 3.4127 0.0097 11.5599 1.6125 3.8891 13.6139 9.0064 0.0975 14.5423 0.7603 0.8250 14.8555 6.8473 31.2586 34.3257 13.7183 83.1621 20.2114 66.2172 26.3166 23.7438 174.8609 153.2028 66.9268 10.9729 46.5167 89.8765 103.6820 4.4738 47.7258 176.9540 27.5001 13.5837 67.6127 16.2824 5.2426 46.8982 12.9421 1.5643 25.4498 16.1486 116.0976 0.1745 469.2933 12.9680 9.5062 2.6006 2.5329 0.1516 1.6855 63.9217
temp: 298.150 k
press: 1.00000 atm
elementType: 17 9 9 9 8 7 6 6 6 6 6 6 6 6 6 6 6 1 1 1 1 1 1 1
symmnumber: 1
zpe: 417620.9 jmol-1
zpe.correction: 0.159063 hartree
zpe.thermalcorrener: 0.173660 hartree
zpe.thermalcorrenthalpy: 0.174604 hartree
zpe.thermalcorrgfe: 0.115806 hartree
zpe.sumelectzpe: -1311.751059 hartree
zpe.sumelectthermal: -1311.736462 hartree
zpe.sumelectthermalent: -1311.735518 hartree
zpe.sumelectthermalfe: -1311.794316 hartree
dipole: 1.1433 -2.7604 -0.0040
dipole: 2.9878
quadrupole: -122.0852 -100.3132 -106.2565
quadrupole: 13.9390 0.0140 -0.0146
quadrupole: -12.5335 9.2384 3.2951 13.9390 0.0140 -0.0146
hfenergy: -1311.9101224 hartree
pointgroup: C01 [X(C11H7Cl1F3N1O1)]
dipole: -0.7049076 0.9406764 -0.004585 debye
dipolederiv: -0.5035472 -0.3812957 0.0002413 -0.2600827 -0.364323 0.0004443 -0.0001385 0.0003147 -0.0305674 -0.7777458 0.2415433 -0.0004549 0.1553723 -0.4752006 0.0001532 -0.0002547 0.0002373 -0.2666114 -0.5498175 -0.1191989 -0.1144339 -0.2103626 -0.5009949 -0.2250187 -0.140273 -0.2365612 -0.5948899 -0.5489867 -0.1187342 0.1144356 -0.2095431 -0.4994261 0.2246122 0.1404606 0.2360021 -0.5961238 -1.3028038 0.5318047 -0.0032652 0.2182334 -0.5865926 0.0009432 -0.0025185 0.0016748 -0.3727398 -0.7358036 0.1867701 -0.0013305 0.6135558 -0.7947222 0.0024388 -0.0024599 0.0016469 -0.2611432 -0.0963229 0.1880998 -0.0008884 -0.2209506 -0.1276536 0.0000936 0.0002337 0.0006222 -0.0027718 0.4970718 -0.4942438 0.0019193 -0.368844 -0.2330129 0.000257 0.0017221 0.0002377 0.146292 -0.3324721 -0.316319 0.0006388 -0.2643253 0.1004889 -0.0011084 0.000999 -0.0011234 -0.1516305 0.4088521 0.1384648 0.0009962 0.0532411 0.4575575 -0.0007585 0.0011548 -0.0003472 -0.0042776 0.7086162 0.5396876 -0.0001191 0.5495205 0.6372032 -0.0009881 -0.0000412 -0.0010172 -0.0968628 0.0088011 -0.1255338 0.000484 0.3127267 -0.2810406 0.0007999 -0.0008037 0.0002715 -0.1250141 -0.6285378 0.0330528 -0.0013309 -0.1472922 0.0364204 -0.0005839 -0.0008219 -0.0003419 -0.1410141 2.104394 0.1271122 0.0002327 0.406114 1.4177781 0.0004636 -0.0005226 0.0003811 1.4433835 -0.3041515 0.1683629 -0.0007451 -0.1121553 -0.0269886 -0.0003535 -0.0000202 -0.0000703 -0.073259 1.6052842 -0.6085262 0.0045624 -0.4195399 0.9513437 -0.0026568 0.0043825 -0.0032293 0.2142301 -0.1862208 -0.12434 -0.0001805 -0.0785994 -0.0936516 -0.0001099 -0.0004296 -0.0003753 -0.0069004 0.2218552 0.0261788 -0.0002127 0.0145224 0.2141306 0.0002248 -0.0003031 0.0002227 0.3027469 0.0588905 0.0363661 -0.0002329 0.0425849 0.0788174 0.0002697 -0.0001612 0.0003318 0.1650735 0.081567 0.0060629 -0.0001721 -0.0097326 -0.0388471 0.0003045 -0.0002416 0.0002753 0.1517063 0.1016066 -0.0027067 -0.0000665 -0.0066525 -0.006476 0.0004661 -0.0000736 0.0004301 0.1642506 0.0662057 -0.0408683 0.067281 -0.0421028 0.1168185 -0.0417552 0.0770174 -0.0059567 0.0100013 0.0363273 0.1492193 -0.0003263 0.0266342 -0.0982779 0.0002953 -0.0002186 0.0005593 0.1170136 0.0669381 -0.0409588 -0.0670325 -0.0423224 0.1166496 0.0415671 -0.0766881 0.005815 0.0091081 unknown
polarizability: 192.2742606|-10.8292554|182.6486638|0.2360101|-0.2944376|63.9149111 unknown
InChI: InChI=1S/C11H7ClF3NO/c1-5-4-8(17)16-10-7(12)3-2-6(9(5)10)11(13,14)15/h2-4,16H,1H3
charge 0 multiplicity 1
24 atoms
Cl 2.591673 3.067498 -0.004245
F  -3.709403 0.8215 -0.003265
F  -2.905274 -0.933805 -1.143708
F  -2.904908 -0.930238 1.14179
O  3.905717 -1.727802 0.011062
N  2.433283 0.080288 0.003294
C  -0.024129 -0.178961 -0.000109
C  1.168202 0.648283 -0.00027
C  -1.286944 0.529141 -0.003158
C  0.207781 -1.64518 0.002872
C  1.065459 2.069576 -0.004107
C  -1.334551 1.939802 -0.007028
C  1.507277 -2.126301 0.006423
C  -2.654518 -0.122429 -0.001669
C  -0.16197 2.722679 -0.007731
C  2.711207 -1.304372 0.007309
C  -0.884916 -2.698658 0.001511
H  3.248481 0.705404 0.003318
H  -2.300455 2.446164 -0.009254
H  1.69157 -3.203983 0.00866
H  -0.217012 3.813661 -0.010792
H  -1.535809 -2.625076 0.886966
H  -0.426224 -3.700022 0.003479
H  -1.531337 -2.626471 -0.887448
