program: Gaussian 09
title: 000268324
version: EM64L-G09RevD.01
frameworkgroup: C1[X(C9H6Br3NO)]
method: RPBEPBE
basis: SDD
operation: Freq
keyword: #p
keyword: freq=noraman
keyword: PBEPBE/SDD
title: #p freq=noraman PBEPBE/SDD
converged: NO YES NO NO
title: Mulliken charges:
elementType: Br Br Br O N C C C C C C C C C H H H H H H
charge: -0.034791 -0.001874 0.082204 -0.225927 -0.434319 -0.670158 0.452776 -0.567654 0.303524 -0.058684 -0.300181 -0.163279 -0.319598 0.138529 0.345976 0.350269 0.252833 0.242004 0.263553 0.344795
chargesum: 0.00000
title: Mulliken charges with hydrogens summed into heavy atoms:
elementType: Br Br Br O N C C C C C C C C C
charge: -0.034791 -0.001874 0.082204 -0.225927 -0.089524 -0.324182 0.452776 -0.217385 0.303524 0.194149 -0.058177 0.100274 -0.319598 0.138529
polarizability: 2.52432265e+02 -2.67040048e-01 1.57343151e+02 -2.08056825e+00 -6.46356676e+00 1.35076801e+02
1716.lowfreq: -2.1667 -0.0007 -0.0004 0.0000 4.8115 8.4475 31.2588 50.1736 74.8661
frequency: 31.2463 50.1700 74.8654 89.1529 131.5195 145.0358 175.2812 187.4425 228.7169 248.8241 305.4626 324.7095 379.6741 406.4856 431.8634 539.3659 551.5003 567.4721 570.7571 591.1839 688.6343 710.4252 739.1318 762.0117 771.5498 806.1819 882.4062 910.3669 919.2333 961.2049 969.5137 1066.6013 1104.8808 1137.3721 1149.2288 1179.7855 1217.5514 1221.3038 1283.9839 1319.5156 1337.7327 1395.3916 1401.2557 1452.0601 1540.2042 1570.5182 1625.2009 1640.7768 3127.4038 3136.2631 3138.0909 3149.0482 3177.9215 3497.8773
redmass: 37.7913 15.6617 20.2243 11.7258 8.8106 13.5757 8.8065 9.1654 5.2449 12.1953 6.1366 7.0679 4.8784 3.6461 7.2456 6.2682 5.5722 5.4836 4.6396 7.1357 2.3520 7.3567 2.7615 2.3209 4.6765 1.9362 5.6619 1.5484 2.5065 4.0680 1.3663 1.9014 1.1664 1.1850 2.8396 1.1318 1.8015 1.8950 2.5114 1.8146 1.5933 2.0179 2.9646 4.1714 6.5629 5.9076 5.5716 7.1439 1.0882 1.0884 1.0900 1.0929 1.0981 1.0771
irintensity: 0.0911 1.4061 1.2425 1.6914 9.6300 0.3741 0.9400 10.1928 8.8100 1.0823 3.9557 14.6579 59.8927 16.5273 23.8107 22.8842 90.1281 35.1804 17.2403 10.2958 6.3275 2.2975 23.8563 9.1647 17.6052 101.3775 19.2917 6.6794 11.0621 72.6338 12.2883 20.4743 36.9366 5.4218 11.7929 6.1199 43.4002 28.4173 3.2754 18.0597 7.6349 33.0449 27.9269 11.4783 3.8797 24.0750 63.8094 489.4882 0.1925 3.4556 2.9553 1.5913 4.2044 55.8928
temp: 298.150 k
press: 1.00000 atm
elementType: 35 35 35 8 7 6 6 6 6 6 6 6 6 6 1 1 1 1 1 1
symmnumber: 1
zpe: 341063.5 jmol-1
zpe.correction: 0.129904 hartree
zpe.thermalcorrener: 0.143154 hartree
zpe.thermalcorrenthalpy: 0.144098 hartree
zpe.thermalcorrgfe: 0.086341 hartree
zpe.sumelectzpe: -515.926205 hartree
zpe.sumelectthermal: -515.912955 hartree
zpe.sumelectthermalent: -515.912011 hartree
zpe.sumelectthermalfe: -515.969768 hartree
dipole: -4.1174 -0.3016 1.3090
dipole: 4.3310
quadrupole: -124.5129 -117.4999 -98.9409
quadrupole: 5.1118 -13.0163 -4.6270
quadrupole: -10.8616 -3.8487 14.7103 5.1118 -13.0163 -4.6270
hfenergy: -516.056109 hartree
pointgroup: C01 [X(C9H6Br3N1O1)]
dipole: -1.5743156 -0.6211235 0.1979371 debye
dipolederiv: -0.3229189 0.1542489 0.0540073 0.160026 -0.4405362 -0.362533 0.3546393 -0.5849384 -0.7875271 -0.2082643 -0.0554213 -0.1757109 0.0856824 -0.1813809 -0.052971 -0.5742916 -0.1349855 -0.8511817 -0.5630897 -0.2624868 0.0967056 -0.4282819 -0.1814842 0.077846 0.1600901 0.0795375 0.0033222 -1.175335 0.4584161 0. 0.637854 -0.6339028 0.0204137 -0.0619542 0.0217739 -0.348314 -0.6930711 0.6703938 0.0267828 -0.2703339 -0.2814015 0.0165268 0.1116706 -0.0284834 -0.2493636 0.665517 -0.5461254 -0.1832314 -0.3785469 0.4732331 0.4831462 -0.4921545 0.6250463 0.8156076 -0.5244101 0.3598693 0.1126619 -0.0613921 -0.3911758 -0.0852475 -0.0303465 0.1490104 -0.0707017 0.0731524 0.0700986 0.2146774 -0.4020596 0.1068206 0.0372889 0.6932029 0.1209515 0.9561797 0.3114464 -0.5404003 0.0908365 -0.1247625 0.3661418 0.0668619 0.0505612 -0.0341792 0.075618 -0.194733 -0.0807395 -0.0651344 0.1931607 0.0401506 -0.0403264 0.1404488 -0.0378171 -0.1147431 0.0406781 0.1687413 0.0102273 0.1909238 0.2129488 -0.0154367 -0.1288066 -0.1251094 -0.1493044 0.1956957 -0.253841 -0.0321828 0.1018778 0.1110822 -0.0359179 0.0071676 -0.0171247 -0.0114079 0.6263876 0.633538 -0.1943094 1.1841069 -0.0396886 -0.1449833 -0.3564183 -0.0951127 -0.1025371 1.3662808 -0.7751384 0.0326058 -0.8557896 0.5550398 -0.094684 0.0827958 -0.0011671 0.2428222 0.0762273 -0.0171422 0.0141912 0.0292462 0.0076887 -0.0358672 0.0319918 -0.0148882 -0.0545132 0.0225349 0.0154891 -0.0195183 0.0221811 0.0740133 -0.0057544 -0.0174388 -0.0460059 -0.0492039 0.00763 -0.0691939 0.0178144 -0.0320584 0.040605 0.0411033 0.0019675 0.0344715 0.1284954 0.0561342 0.061947 -0.0243498 -0.0034174 -0.0527391 0.0696289 0.0172759 0.0513629 0.1555671 0.0961762 0.0357925 -0.0108806 -0.0087711 -0.0103254 0.031297 -0.0017654 0.0232083 0.1162567 0.1439614 -0.0280457 0.0348075 -0.0396456 0.2249104 0.0296088 0.0113644 0.0144493 0.2949288 unknown
polarizability: 251.4426737|10.2364058|150.404946|-1.3297804|12.4203039|143.0045981 unknown
InChI: InChI=1S/C9H6Br3NO/c10-5-1-2-7-4(8(5)12)3-6(11)9(14)13-7/h1-3,5,8,13H
charge 0 multiplicity 1
20 atoms
Br -1.907299 1.946118 1.982407
Br -3.087307 -0.019654 -2.232774
Br 3.770524 1.658438 -0.676002
O  3.440751 -1.425416 0.068714
N  1.117945 -1.446032 0.293087
C  -1.606141 1.115657 0.027446
C  -0.2654 0.489201 -0.02549
C  -2.784777 0.167102 -0.145559
C  -0.143145 -0.8790 0.280633
C  -2.573577 -1.21141 0.377839
C  -1.309128 -1.701989 0.575621
C  0.920631 1.245217 -0.304931
C  2.170066 0.646842 -0.28799
C  2.357025 -0.778992 0.022794
H  -1.705973 2.028315 -0.574382
H  -3.737407 0.622317 0.151843
H  -3.455199 -1.833987 0.555486
H  -1.161134 -2.727733 0.932861
H  0.829357 2.31372 -0.527331
H  1.227988 -2.445711 0.498524
