program: Gaussian 09
title: 000268321
version: EM64L-G09RevD.01
frameworkgroup: C1[X(C11H10BrNO)]
method: RPBEPBE
basis: SDD
operation: Freq
keyword: #p
keyword: freq=noraman
keyword: PBEPBE/SDD
title: #p freq=noraman PBEPBE/SDD
converged: YES YES NO NO
title: Mulliken charges:
elementType: Br O N C C C C C C C C C C C H H H H H H H H H H
charge: -0.020324 -0.261367 -0.421860 0.269036 0.369346 0.278395 0.144033 -0.024877 -0.359770 -0.911796 -0.386209 -0.837579 -0.280011 -0.215180 0.332814 0.245831 0.294876 0.314081 0.234091 0.231284 0.289224 0.247587 0.234047 0.234327
chargesum: 0.00000
title: Mulliken charges with hydrogens summed into heavy atoms:
elementType: Br O N C C C C C C C C C C C
charge: -0.020324 -0.261367 -0.089046 0.269036 0.369346 0.278395 0.144033 -0.024877 -0.113939 -0.302839 -0.152119 -0.069484 -0.045964 0.019147
polarizability: 1.71009958e+02 9.37766283e+00 2.03242820e+02 6.11141889e+00 -1.07835281e+00 7.99558855e+01
1716.lowfreq: -8.6778 -0.0005 -0.0004 -0.0004 6.1812 8.3917 44.4761 63.1586 101.9780
frequency: 44.4375 63.1128 101.9734 103.7546 140.8279 164.7959 267.7473 282.7666 319.3910 341.4514 347.0361 423.3781 433.1243 445.6211 480.5786 543.5394 546.3442 588.6210 647.7514 663.2018 681.2566 695.4811 747.1847 772.8933 781.9487 796.5057 864.5787 876.0854 917.4003 945.4405 983.2241 995.3930 1038.7514 1040.9750 1084.2087 1125.1915 1138.8608 1175.1762 1184.0720 1220.3968 1263.4742 1273.3659 1286.7019 1361.4954 1387.6530 1399.4542 1412.2053 1456.1679 1461.7835 1481.2267 1486.1628 1501.1882 1555.4784 1597.9438 1612.8577 1628.4422 2976.7109 3055.0711 3083.4421 3105.6205 3127.4326 3143.1381 3155.4733 3164.7731 3173.2642 3511.6685
redmass: 7.5604 6.4647 4.4874 5.1992 1.0355 6.3763 4.2940 4.0135 3.9995 3.9146 2.9780 5.2276 4.5746 6.2536 3.9945 4.0920 5.5369 4.0602 4.0939 4.1045 5.5792 2.0283 2.1487 1.5607 2.9993 2.4497 1.6044 4.1286 1.7273 1.3835 1.3282 2.3403 1.5300 2.0599 2.6264 1.9687 1.4128 1.4002 1.4590 1.1946 1.6908 5.0427 1.9964 3.0308 1.6981 1.6069 3.9952 1.2109 3.1890 1.1248 1.0645 2.4377 7.3985 5.5607 6.6969 5.7406 1.0394 1.0959 1.0586 1.0975 1.0878 1.0879 1.0945 1.1085 1.1003 1.0765
irintensity: 1.1765 0.4717 4.0975 0.3145 0.4328 1.5275 2.5637 1.0659 0.2172 8.4311 2.4244 3.0888 7.4533 5.2025 33.1758 4.8786 24.4777 4.0341 8.7187 7.1078 3.3655 2.5508 0.3880 177.4798 5.1885 4.3203 3.9049 2.6093 10.3280 2.4378 0.3263 11.5319 3.5414 2.3201 0.4268 14.3393 12.3140 24.7601 6.8805 40.8311 8.9870 5.8935 4.2539 26.4455 31.9179 17.7894 17.8511 15.9340 8.2415 13.0076 17.8828 19.9037 67.1244 64.7241 141.3497 239.8480 18.1377 13.4112 10.7173 2.3274 5.4268 2.3358 22.0128 0.2416 20.1556 36.4380
temp: 298.150 k
press: 1.00000 atm
elementType: 35 8 7 6 6 6 6 6 6 6 6 6 6 6 1 1 1 1 1 1 1 1 1 1
symmnumber: 1
zpe: 482553.7 jmol-1
zpe.correction: 0.183795 hartree
zpe.thermalcorrener: 0.196109 hartree
zpe.thermalcorrenthalpy: 0.197053 hartree
zpe.thermalcorrgfe: 0.143742 hartree
zpe.sumelectzpe: -567.649890 hartree
zpe.sumelectthermal: -567.637576 hartree
zpe.sumelectthermalent: -567.636632 hartree
zpe.sumelectthermalfe: -567.689943 hartree
dipole: -1.5754 -3.0521 1.7747
dipole: 3.8662
quadrupole: -83.7789 -99.2926 -91.3966
quadrupole: 10.7067 5.9474 1.6883
quadrupole: 7.7105 -7.8032 0.0927 10.7067 5.9474 1.6883
hfenergy: -567.833685 hartree
pointgroup: C01 [X(C11H10Br1N1O1)]
dipole: 1.3285013 -0.167692 -0.7215262 debye
dipolederiv: -0.1255783 -0.0445627 0.0024921 -0.0525948 -0.5790352 0.1470075 0.0334604 0.3944187 -0.31338 -1.0174583 0.327764 0.0427688 0.6783159 -0.993093 -0.0603079 0.1228147 -0.0997587 -0.3843838 -0.9512606 0.3410567 0.0773006 -0.0464501 -0.3573857 0.0124073 -0.0182689 -0.0068503 -0.2728059 -0.2302976 0.0803981 -0.014096 0.0299461 -0.2377845 -0.0235152 -0.0122468 -0.0159909 -0.0022686 0.3577843 0.0007317 -0.0432908 0.1158574 0.0171182 0.0511594 0.0695761 -0.0572398 -0.129373 0.3730304 -0.3645605 -0.0710403 -0.2539435 0.2656729 0.0325861 -0.040406 0.0218787 0.1117906 0.2649372 -0.0854702 0.0712206 0.5181317 -0.4810071 -0.0038685 0.1217344 -0.0708625 -0.0140507 1.2510891 -0.3654796 -0.0769565 -0.7373389 1.1688281 0.0726617 -0.1367794 0.1386645 0.2168549 0.2378941 -0.0076448 0.003669 -0.0928546 0.1178842 0.0222153 -0.023587 0.0035745 -0.1220452 0.0304498 0.0496851 -0.017803 -0.0031853 0.73143 -0.3137077 -0.072227 -0.4343487 0.4355727 -0.0868301 0.1880888 0.0387663 0.0214067 0.0467528 0.0435046 0.0109301 0.050021 -0.1869321 -0.2149739 -0.0100542 -0.0085476 -0.1709243 -0.025472 -0.0225084 -0.0900735 0.0078291 0.0391243 -0.2294225 -0.0947031 -0.0033308 -0.3047526 -0.043715 0.020311 -0.0378785 0.0119915 -0.1755856 0.0108316 -0.0124414 0.0108739 0.2490888 0.0961909 0.0417138 0.0477219 0.0424062 -0.123244 0.1186924 -0.0157137 -0.0071006 -0.003068 0.1901305 -0.0272991 -0.0052746 -0.0202778 0.3042026 0.1064414 -0.0424968 -0.0241652 -0.0243393 -0.0704436 -0.0326776 -0.0057944 -0.0220455 0.1289271 0.0414631 0.0934203 0.0956765 0.0051342 -0.0072178 0.0461624 0.0811627 0.0571044 -0.0417711 -0.017173 -0.0737442 -0.0613325 0.0128887 0.0324416 0.0845187 -0.0480904 0.0831376 -0.0106429 0.0774218 0.0151656 0.0000003 -0.0444469 -0.0984024 -0.0476254 -0.0098746 -0.0490819 0.1602199 0.0117637 -0.0110913 -0.0204584 -0.035098 0.1043838 -0.0695122 -0.0762894 -0.0489993 -0.0865512 0.1001063 0.0253879 0.0150087 0.1592324 0.0541361 -0.0296485 0.057523 -0.0332616 0.1092214 0.0335004 -0.0169585 -0.0030258 -0.0620094 -0.0129006 0.095121 0.0475558 0.0846712 0.0404917 -0.0417868 0.0859939 0.0112588 0.1049808 0.006899 -0.0234661 0.0075045 -0.0207175 0.1625695 -0.1006246 -0.0627715 -0.0178884 -0.0639771 0.0745888 -0.0152323 -0.0231931 -0.0162629 0.1540594 unknown
polarizability: 203.0618664|-9.6408406|171.3876965|-0.1616315|-4.6139431|79.7591011 unknown
InChI: InChI=1S/C11H10BrNO/c1-7-9(6-12)8-4-2-3-5-10(8)13-11(7)14/h2-5,13H,6H2,1H3
charge 0 multiplicity 1
24 atoms
Br -1.10269 -3.418222 0.986484
O  -2.364262 2.469331 0.300146
N  -0.115975 1.89146 0.225591
C  0.65548 -0.378225 -0.179109
C  -0.747308 -0.778487 -0.316569
C  0.948284 0.998251 0.090266
C  -1.780798 0.141578 -0.145845
C  -1.482516 1.564953 0.140467
C  1.75223 -1.281523 -0.287545
C  -1.078353 -2.195466 -0.674448
C  2.288471 1.449559 0.219509
C  -3.249144 -0.211092 -0.227622
C  3.07821 -0.837822 -0.154796
C  3.346541 0.534919 0.094508
H  0.078001 2.878861 0.420658
H  1.563029 -2.346848 -0.451227
H  -0.339184 -2.672061 -1.332508
H  -2.088296 -2.31067 -1.085123
H  2.488943 2.508729 0.420252
H  -3.555908 -0.460194 -1.262114
H  -3.845583 0.657303 0.09373
H  -3.496651 -1.075047 0.415648
H  3.904755 -1.550561 -0.236537
H  4.380222 0.881978 0.196385
