program: Gaussian 09
title: 000268320
version: EM64L-G09RevD.01
frameworkgroup: C1[X(C11H10ClNO)]
method: RPBEPBE
basis: SDD
operation: Freq
keyword: #p
keyword: freq=noraman
keyword: PBEPBE/SDD
title: #p freq=noraman PBEPBE/SDD
converged: NO YES NO NO
title: Mulliken charges:
elementType: Cl O N C C C C C C C C C C C H H H H H H H H H H
charge: -0.060000 -0.275587 -0.216358 0.233395 0.239233 0.509413 0.130545 -0.448718 -0.343976 -0.366917 -0.662646 -0.798049 -0.234408 -0.274107 0.256655 0.256720 0.259121 0.239281 0.237225 0.291896 0.282152 0.277321 0.232660 0.235145
chargesum: 0.00000
title: Mulliken charges with hydrogens summed into heavy atoms:
elementType: Cl O N C C C C C C C C C C C
charge: -0.060000 -0.275587 -0.216358 0.233395 0.239233 0.509413 0.130545 -0.192063 -0.087256 -0.107796 0.105757 -0.238575 -0.001748 -0.038961
polarizability: 1.65660015e+02 1.13068717e+01 1.87400834e+02 4.88738331e+00 -4.25481151e+00 7.26523296e+01
1716.lowfreq: 0.0005 0.0006 0.0014 2.1334 6.2053 8.3768 61.2631 67.9836 103.4588
frequency: 61.2569 67.9769 103.4579 125.1353 194.1206 222.0485 242.8490 279.1282 309.8432 329.0460 384.0845 410.9829 439.3068 469.9269 507.1010 529.0798 571.0484 590.6536 660.3797 675.8492 696.0258 711.4349 758.6929 773.4897 783.8774 861.7667 884.2970 900.3909 934.9742 946.0692 984.9376 1043.8172 1049.3478 1085.1224 1122.0691 1131.7934 1145.2857 1169.5334 1183.2627 1223.1924 1258.0284 1269.0985 1302.9884 1321.3898 1383.6719 1405.5534 1423.2008 1447.9079 1463.2764 1473.7112 1498.4159 1502.3504 1553.9798 1568.8359 1620.7598 1640.5310 2989.9057 3067.2906 3078.0394 3119.5506 3138.9053 3148.9387 3152.8930 3170.3297 3170.7910 3182.9437
redmass: 6.0228 6.8731 6.7697 3.4555 5.2440 1.7449 1.8194 3.0784 3.5505 4.4502 4.2350 4.3366 5.5293 5.6810 5.5355 3.4844 4.7520 5.0207 6.5339 3.3588 5.7223 5.7673 1.7368 2.2038 4.1620 1.5741 1.6098 2.2969 1.7986 1.3796 1.3265 3.3966 3.0273 3.4352 1.3157 1.2393 1.6724 2.0016 1.0961 1.7799 1.2379 1.7178 1.9602 3.0009 3.3992 3.5394 1.4151 2.5640 1.1357 1.1584 1.0510 2.4700 7.3637 6.7877 6.3119 8.0464 1.0343 1.0581 1.1024 1.0992 1.0862 1.1084 1.0916 1.0932 1.0958 1.0966
irintensity: 0.7041 4.1506 2.4972 0.3886 3.0836 1.6800 4.4524 1.3284 0.9970 1.4206 9.2188 4.2679 3.2059 3.3753 6.8125 5.5377 7.2205 29.3526 13.7177 2.0083 10.8289 9.8918 63.8073 41.2923 5.6932 0.4298 16.5240 13.6476 3.4218 1.7234 0.1423 4.2377 15.3050 3.3739 0.2146 15.0966 6.4044 2.7554 0.6809 6.0739 16.2252 9.5890 27.7612 7.5735 24.2050 9.1451 18.8492 77.7223 9.6808 64.1327 19.2263 9.8476 86.2511 151.7511 4.1103 239.1877 37.9962 15.4463 22.6412 1.4694 2.0530 8.1685 6.1547 2.6987 17.8590 10.7272
temp: 298.150 k
press: 1.00000 atm
elementType: 17 8 7 6 6 6 6 6 6 6 6 6 6 6 1 1 1 1 1 1 1 1 1 1
symmnumber: 1
zpe: 483984.8 jmol-1
zpe.correction: 0.184340 hartree
zpe.thermalcorrener: 0.196296 hartree
zpe.thermalcorrenthalpy: 0.197240 hartree
zpe.thermalcorrgfe: 0.145723 hartree
zpe.sumelectzpe: -1014.235723 hartree
zpe.sumelectthermal: -1014.223767 hartree
zpe.sumelectthermalent: -1014.222823 hartree
zpe.sumelectthermalfe: -1014.274340 hartree
dipole: -0.5605 3.8283 1.5431
dipole: 4.1654
quadrupole: -86.1888 -91.5506 -90.1677
quadrupole: -10.4134 7.4633 -2.4153
quadrupole: 3.1136 -2.2482 -0.8653 -10.4134 7.4633 -2.4153
hfenergy: -1014.4200626 hartree
pointgroup: C01 [X(C11H10Cl1N1O1)]
dipole: -1.2885811 -0.8154714 0.6002082 debye
dipolederiv: -0.2552893 0.1877477 -0.0920108 0.1341562 -0.4947774 0.0997223 -0.1652209 0.3147123 -0.3520331 -1.4746733 -0.0514071 -0.0094039 0.2724396 -0.4765159 0.0015461 0.0455266 -0.0052232 -0.3736055 -1.0569 0.1304374 0.0300922 -0.3142934 -0.5319082 -0.0323836 -0.0354747 -0.0550392 -0.1630084 0.7674966 -0.2046905 -0.0433689 0.0524373 -0.0241344 -0.0196948 -0.0011945 -0.0117282 0.0979703 -0.3517098 -0.0339251 -0.014209 -0.0468859 -0.2973522 -0.0354131 -0.0034885 -0.0528255 -0.0053434 0.4406404 0.2691065 -0.0124677 0.2521389 0.248565 0.0037821 0.0528356 -0.0043441 -0.1087676 1.7210766 0.1319976 0.0135869 -0.1821219 0.6344122 0.0183384 -0.0300118 0.0290368 0.2024485 -0.4135293 -0.0078121 0.0032895 0.4604468 -0.1644687 0.041041 0.045421 0.0015106 -0.1271751 -0.2337309 0.1029304 0.015947 -0.1477153 0.0669254 0.0383079 -0.0185386 0.0366049 -0.1914559 0.2639179 0.1369226 0.014488 0.0167275 0.1337608 0.0227917 0.0012782 -0.0145461 -0.1259558 0.0553953 -0.1768256 -0.0175236 -0.1161519 0.3396112 0.0146305 -0.0168007 0.021578 0.2117135 0.2822231 -0.2345528 0.1600771 -0.2273732 0.5343068 -0.1695831 0.1759376 -0.3049184 0.4701133 -0.0133501 -0.1274713 -0.0127873 0.1236136 0.2302803 0.0474986 0.014122 0.0515974 -0.1274151 0.0067427 -0.0628785 -0.0047989 -0.2418804 -0.3215096 -0.0094053 -0.0137854 -0.0132125 -0.1755227 0.0519679 -0.0628621 -0.0013267 -0.0375395 -0.009655 -0.0249259 -0.0059424 -0.0150471 0.1440227 0.0728257 0.0782989 0.0110934 0.0466602 -0.0486572 -0.0283149 0.0078341 -0.0289749 0.1581378 0.0846154 0.0495434 -0.0013806 0.0719461 -0.0382174 -0.0326832 -0.0005197 -0.0168533 0.1350617 0.1004973 -0.0530203 -0.0981277 0.0275661 -0.0145718 -0.0471914 -0.0386707 -0.0835894 -0.0681471 0.1014798 -0.0737348 0.077459 0.0172656 -0.0571317 0.0577764 0.0423001 0.090386 -0.0332527 -0.0039167 0.0905328 0.012615 -0.0952175 0.1905358 0.006213 -0.0130177 0.0082645 0.13253 -0.0206516 -0.0972563 -0.0944328 -0.0059464 0.0054631 0.0199708 -0.0574669 0.0297907 0.0239748 -0.018655 0.0915687 0.0697595 0.0184068 0.0487656 0.0614149 0.0302197 0.0611216 -0.0411545 0.0084367 -0.0979885 -0.012011 -0.1076264 -0.0355032 -0.0237803 -0.01509 -0.0264857 0.1521158 -0.1149094 0.0153392 0.0054412 0.028947 0.0817766 -0.0096581 -0.0002523 -0.0118152 0.1647486 unknown
polarizability: 191.9141705|1.2176643|161.2706493|5.7629444|2.3793047|72.5283585 unknown
InChI: InChI=1S/C11H10ClNO/c1-13-10-5-3-2-4-9(10)8(7-12)6-11(13)14/h2-6H,7H2,1H3
charge 0 multiplicity 1
24 atoms
Cl -1.018635 3.611746 -0.974042
O  3.415372 -0.365497 0.032014
N  1.218955 -1.213317 -0.06465
C  -0.173559 -1.013628 -0.023798
C  -0.707322 0.310058 0.168555
C  0.225819 1.419897 0.3287
C  2.161118 -0.147623 0.077392
C  1.58392 1.180164 0.277666
C  -1.069838 -2.111401 -0.169985
C  -2.119757 0.484895 0.192349
C  1.775544 -2.567276 -0.265739
C  -0.255196 2.819329 0.589772
C  -2.458984 -1.905631 -0.132102
C  -2.992812 -0.603855 0.047411
H  2.314075 1.987229 0.387569
H  -0.684017 -3.123055 -0.313722
H  -2.530364 1.492953 0.302553
H  1.447973 -2.985493 -1.233888
H  1.466246 -3.243914 0.550476
H  2.871221 -2.466849 -0.262476
H  0.569233 3.491733 0.861071
H  -1.060068 2.873542 1.337227
H  -3.131662 -2.762444 -0.247495
H  -4.075964 -0.449064 0.064241
