program: Gaussian 09
title: 000268315
version: EM64L-G09RevD.01
frameworkgroup: C1[X(C10H8BrNO)]
method: RPBEPBE
basis: SDD
operation: Freq
keyword: #p
keyword: freq=noraman
keyword: PBEPBE/SDD
title: #p freq=noraman PBEPBE/SDD
converged: NO YES NO NO
title: Mulliken charges:
elementType: Br O N C C C C C C C C C C H H H H H H H H
charge: 0.059197 -0.248529 -0.226159 0.237274 0.355888 -0.184558 0.216610 -0.330847 -0.387370 -0.338484 -0.659735 -0.230717 -0.258988 0.259355 0.256713 0.237633 0.239815 0.239828 0.293711 0.232706 0.236656
chargesum: 0.00000
title: Mulliken charges with hydrogens summed into heavy atoms:
elementType: Br O N C C C C C C C C C C
charge: 0.059197 -0.248529 -0.226159 0.237274 0.355888 0.074797 0.216610 -0.074134 -0.149737 -0.338484 0.113619 0.001989 -0.022331
polarizability: 2.26072325e+02 -1.62222521e+01 1.41226801e+02 -6.57945961e-03 4.10565078e-03 5.34036683e+01
1716.lowfreq: -0.0005 -0.0004 -0.0002 1.5314 6.0494 11.9563 75.5259 95.3047 139.3630
frequency: 75.4749 95.3043 139.3630 157.2285 228.8796 237.4780 273.0867 304.9107 308.4230 393.5287 417.2864 436.1214 483.4353 490.7721 555.5978 574.1166 616.7181 700.8650 721.1093 758.0049 762.1804 782.2767 859.5098 867.9433 910.4766 915.9971 953.1405 985.8158 1036.7394 1057.7278 1110.0326 1119.2568 1142.9135 1178.8500 1224.2427 1241.8602 1280.5650 1324.0005 1350.3070 1406.6584 1421.6114 1444.4867 1474.4713 1493.7989 1499.8835 1558.2137 1573.2802 1616.7531 1622.9615 2992.1502 3079.1983 3126.7924 3131.4640 3142.0628 3150.5313 3165.7505 3179.9437
redmass: 6.4942 5.0317 3.4261 9.2291 1.1121 12.6526 3.9518 4.9424 4.2948 4.1770 4.2139 8.8773 3.0347 5.3455 3.4801 6.6184 6.1146 6.6250 7.4061 1.7160 2.2387 6.7044 1.3989 5.3690 1.4264 3.4700 1.4054 1.3288 2.4459 3.8364 2.3458 1.3133 1.6058 1.1055 1.9766 1.9955 2.1486 2.7343 2.1114 7.2680 1.3007 2.4387 1.1890 2.4382 1.0448 6.7649 7.8635 7.4739 7.5937 1.0348 1.1025 1.0988 1.0876 1.0899 1.0929 1.0959 1.0969
irintensity: 2.3769 3.1970 1.2799 0.4457 0.6765 0.2687 1.7013 0.0126 0.6004 7.0429 0.0796 5.1719 8.9763 11.5870 0.5042 11.4943 9.2420 0.3408 10.7940 27.2036 64.9252 45.9803 4.2977 9.6264 16.2177 40.5941 8.3165 0.0007 13.2191 17.3313 4.3219 0.1223 15.3834 0.3283 35.7125 16.3485 8.8051 2.6654 0.0349 11.6432 18.4436 44.1380 75.2051 2.9789 20.1742 1.4318 239.9201 50.0823 124.2243 35.0227 22.1446 1.3967 2.3307 7.7463 5.1210 22.8894 12.9518
temp: 298.150 k
press: 1.00000 atm
elementType: 35 8 7 6 6 6 6 6 6 6 6 6 6 1 1 1 1 1 1 1 1
symmnumber: 1
zpe: 407636.8 jmol-1
zpe.correction: 0.155261 hartree
zpe.thermalcorrener: 0.166125 hartree
zpe.thermalcorrenthalpy: 0.167069 hartree
zpe.thermalcorrgfe: 0.117720 hartree
zpe.sumelectzpe: -528.403851 hartree
zpe.sumelectthermal: -528.392986 hartree
zpe.sumelectthermalent: -528.392042 hartree
zpe.sumelectthermalfe: -528.441391 hartree
dipole: 5.2985 -1.5516 -0.0005
dipole: 5.5210
quadrupole: -79.5407 -76.8935 -88.1978
quadrupole: 7.9626 0.0009 -0.0008
quadrupole: 2.0033 4.6505 -6.6538 7.9626 0.0009 -0.0008
hfenergy: -528.5591113 hartree
pointgroup: C01 [X(C10H8Br1N1O1)]
dipole: -2.1719294 0.0306376 0.0002007 debye
dipolederiv: -0.5839668 0.2365025 0.0000286 0.3760158 -0.1639711 -0.0000433 0.0001041 -0.0000524 0.0061832 -1.1519264 -0.2972981 -0.0000928 -0.5711138 -0.6539011 -0.0000399 0.000277 0.0001843 -0.3515366 -0.9267686 -0.4141768 0.000088 0.1804559 -0.5525409 -0.0000101 -0.0000134 0.0000266 -0.1612088 0.5197489 0.4963585 -0.0000202 0.2279531 0.1217546 0.0000024 -0.0000947 0.0000764 0.0960588 -0.2871262 0.0000756 -0.0000097 -0.1163829 -0.1731081 0.0000206 0.0002525 -0.0000838 0.0184893 0.1556063 0.0897378 0.0000411 0.0276332 0.0868783 -0.0000177 0.0001066 -0.0000747 -0.0558235 1.2752011 0.4844919 0.0000503 0.5773172 0.7254177 0.0000171 -0.0000699 -0.0001898 0.2307367 -0.1590912 -0.2303927 0.000012 0.0099228 0.0552767 -0.0000219 0.0000479 -0.000067 -0.1939296 0.2890191 -0.0602398 0.00001 0.1168502 0.1198417 -0.0000284 -0.0002847 0.0001137 -0.1444193 0.8057792 -0.5648865 -0.0001086 -1.0009625 -0.0305678 0.0001046 -0.0002185 0.0000533 -0.1648065 -0.0240173 0.0353756 -0.0000064 -0.0461075 0.4042437 -0.0000071 0.0003176 -0.0001666 0.209421 -0.0354559 0.0481586 0.0000047 -0.2062962 0.1902894 -0.0000193 0.0000403 -0.0000278 -0.1389756 -0.1542158 0.1223656 0.0000132 0.3117027 -0.1596783 -0.0000048 -0.0002209 0.0000796 -0.1754305 0.0911793 -0.03149 0.0000035 0.0322391 -0.0474105 -0.0000007 -0.0001359 0.0000517 0.1462142 0.0981573 -0.0186199 0.0000014 0.0217821 -0.076435 0.0000306 -0.0001479 0.000061 0.1643728 0.0909163 0.0419132 -0.0000023 -0.0164257 -0.0920021 0.0000215 0.0002668 -0.0001016 0.1534275 0.0614178 0.1066365 0.103509 0.0255961 0.0009562 -0.0167755 0.0703108 -0.0614121 -0.0498259 0.0612418 0.1066616 -0.1035023 0.0255508 0.0009956 0.0167546 -0.0705667 0.0615152 -0.0498574 0.0299052 -0.1506669 -0.0000012 0.0212286 0.1628279 0.0000094 -0.0000786 0.0000399 0.1338703 -0.07405 0.0825731 -0.0000125 0.0931093 0.0414166 0.0000096 -0.000027 0.0000241 0.1570253 -0.0815538 -0.0830798 -0.0000059 -0.0900684 0.0397167 -0.0000016 0.0001347 -0.0000499 0.1700146 unknown
polarizability: 227.8439247|-10.4742838|139.455202|-0.0074969|-0.0019856|53.4036683 unknown
InChI: InChI=1S/C10H8BrNO/c1-12-9-5-3-2-4-7(9)6-8(11)10(12)13/h2-6H,1H3
charge 0 multiplicity 1
21 atoms
Br 3.465292 -1.824985 -0.000193
O  2.877991 1.24983 -0.0003
N  0.52417 1.206095 0.00003
C  -0.698119 0.513149 0.000039
C  -0.691536 -0.923979 0.000091
C  0.576741 -1.613977 0.000047
C  1.811292 0.567247 0.000203
C  -1.945521 1.200029 -0.000003
C  -1.926262 -1.632509 0.000103
C  1.754338 -0.906864 0.000022
C  0.531183 2.685686 -0.000125
C  -3.150176 0.474779 0.000026
C  -3.149697 -0.94603 0.000079
H  0.58594 -2.708994 -0.000015
H  -1.977874 2.292208 -0.000042
H  -1.902355 -2.728541 0.000123
H  0.027449 3.077557 0.901157
H  0.027587 3.077371 -0.901564
H  1.582587 3.007671 -0.000069
H  -4.101175 1.018504 0.000002
H  -4.095359 -1.496747 0.000088
