program: Gaussian 09
title: 000268305
version: EM64L-G09RevD.01
frameworkgroup: C1[X(C13H12N2O3)]
method: RPBEPBE
basis: SDD
operation: Freq
keyword: #p
keyword: freq=noraman
keyword: PBEPBE/SDD
title: #p freq=noraman PBEPBE/SDD
converged: YES YES NO NO
title: Mulliken charges:
elementType: O O O N N C C C C C C C C C C C C C H H H H H H H H H H H H
charge: -0.269416 -0.202684 -0.215904 -0.212959 0.043159 0.234063 0.210642 0.339465 -0.432619 0.117467 -0.370990 -0.345726 -0.366924 -0.661847 -0.271575 -0.235685 0.333198 -0.766704 0.271689 0.244941 0.258440 0.276764 0.239760 0.239552 0.292552 0.238794 0.235149 0.267578 0.250001 0.259817
chargesum: 0.00000
title: Mulliken charges with hydrogens summed into heavy atoms:
elementType: O O O N N C C C C C C C C C C C C C
charge: -0.269416 -0.202684 -0.215904 -0.212959 0.043159 0.234063 0.210642 0.339465 -0.160930 0.117467 -0.126049 -0.087285 -0.090160 0.110017 -0.032781 -0.000535 0.333198 0.010692
polarizability: 2.60419752e+02 8.55235750e+00 2.14448886e+02 -3.29284022e+00 -1.32210210e+00 8.38251940e+01
1716.lowfreq: -9.3551 0.0003 0.0009 0.0009 2.2337 5.7221 37.6852 51.9554 62.9176
frequency: 37.6531 51.9386 62.9080 77.4156 98.4761 121.0662 174.1040 189.6658 206.6794 228.5926 251.9383 276.4464 318.6246 330.1778 356.6512 384.6529 410.9960 440.6721 450.9557 474.0867 505.4251 529.9418 555.9436 585.8997 613.3858 650.5110 679.6359 687.0099 698.2568 719.6563 762.3395 769.1209 798.2170 825.3325 866.9676 893.2651 904.8604 938.5458 951.3865 962.9107 988.5485 1045.1344 1048.3822 1052.9873 1092.9439 1102.3391 1119.9225 1149.1571 1164.8381 1183.7845 1187.4450 1227.1050 1264.3758 1296.0730 1319.2349 1335.0246 1371.2207 1380.3233 1403.4994 1416.0078 1423.1979 1445.6887 1450.0758 1466.2781 1472.3792 1498.2724 1499.5352 1544.6000 1568.4254 1618.6888 1623.5605 1660.4566 2989.6892 2998.0682 3077.6402 3081.2669 3116.6529 3118.7043 3120.3174 3139.5496 3148.7336 3169.6319 3183.5978 3188.6750
redmass: 6.5294 4.7947 6.0618 4.8050 7.0843 3.0678 1.3274 4.1705 5.3236 1.2297 2.7170 4.8858 3.8122 4.5269 3.2766 4.4063 3.7001 6.1710 3.5701 5.8200 6.8528 3.3092 6.4071 4.8977 3.8941 6.0942 5.0723 5.0651 5.6841 6.1311 1.8161 2.2660 6.0807 3.9098 1.5611 1.4336 2.8905 1.5973 1.5007 2.1429 1.3300 1.6208 2.0388 3.9843 2.4815 2.0456 1.3166 1.7207 2.6273 1.1011 9.3304 1.9332 1.8426 1.9744 3.1783 1.7156 8.0560 2.5392 3.4124 1.4904 1.3817 2.2687 1.1059 1.0787 1.1833 2.2523 1.0672 7.2263 6.9450 6.2665 7.9840 7.8082 1.0345 1.0383 1.1025 1.0953 1.0967 1.0907 1.0990 1.0859 1.0906 1.0964 1.0965 1.0922
irintensity: 0.8964 0.3200 3.1744 1.2158 5.9557 0.0217 0.2312 6.1306 0.1327 0.0619 2.2350 0.4403 1.5457 1.0883 1.9287 8.8633 2.5718 3.2446 8.1586 4.1565 6.3447 1.2243 1.7596 12.4238 6.2639 8.2150 8.4326 1.2447 10.0171 3.6715 59.6256 34.2046 31.8239 1.8497 0.7411 19.7113 12.1779 20.3766 12.5936 61.4699 0.4214 1.5048 7.5880 14.5156 3.2093 2.1475 0.1925 16.1694 29.3261 8.5697 309.6879 7.3313 16.6588 12.7321 28.7612 21.9339 127.2131 43.2942 8.3289 6.9288 21.5583 58.0969 20.1908 17.8041 79.1381 13.8682 18.7530 45.2057 170.4809 9.1008 206.9570 45.5874 41.3951 3.3184 21.4414 5.7418 5.4373 0.5917 1.7268 0.5214 11.5069 17.3399 11.5373 0.5806
temp: 298.150 k
press: 1.00000 atm
elementType: 8 8 8 7 7 6 6 6 6 6 6 6 6 6 6 6 6 6 1 1 1 1 1 1 1 1 1 1 1 1
symmnumber: 1
zpe: 595706.5 jmol-1
zpe.correction: 0.226893 hartree
zpe.thermalcorrener: 0.242733 hartree
zpe.thermalcorrenthalpy: 0.243677 hartree
zpe.thermalcorrgfe: 0.182967 hartree
zpe.sumelectzpe: -836.403237 hartree
zpe.sumelectthermal: -836.387397 hartree
zpe.sumelectthermalent: -836.386453 hartree
zpe.sumelectthermalfe: -836.447163 hartree
dipole: 5.2157 2.2704 1.4105
dipole: 5.8608
quadrupole: -113.2383 -111.0558 -106.4623
quadrupole: 14.1387 -2.9023 0.4279
quadrupole: -2.9862 -0.8037 3.7899 14.1387 -2.9023 0.4279
hfenergy: -836.6301295 hartree
pointgroup: C01 [X(C13H12N2O3)]
dipole: -2.0284239 -1.0589392 0.2843312 debye
polarizability: 259.5691304|8.4163181|207.6053014|8.5971487|30.5247148|91.5194008 unknown
InChI: InChI=1S/C13H12N2O3/c1-9(15(17)18)7-10-8-13(16)14(2)12-6-4-3-5-11(10)12/h3-8H,1-2H3
charge 0 multiplicity 1
30 atoms
O  -1.833582 3.12254 0.524498
O  5.129302 0.229188 0.531799
O  4.125579 -1.109165 -1.015674
N  -2.496095 0.887616 0.178972
N  4.081111 -0.239818 -0.060085
C  -0.793453 -0.869539 -0.134799
C  -2.171174 -0.464652 -0.032882
C  0.249916 0.152506 -0.033326
C  -0.11977 1.471613 0.176774
C  -1.50619 1.910898 0.312484
C  -0.496301 -2.251144 -0.310216
C  -3.196355 -1.448456 -0.140144
C  1.659803 -0.224518 -0.241271
C  -3.907639 1.312027 0.282389
C  -1.513708 -3.211857 -0.412099
C  -2.868982 -2.800937 -0.33079
C  2.75023 0.27965 0.409442
C  2.829675 1.247292 1.555638
H  0.61663 2.277805 0.205619
H  0.54931 -2.572357 -0.353461
H  -4.246994 -1.158164 -0.070555
H  1.873174 -0.97863 -1.010621
H  -4.404488 0.820574 1.137666
H  -4.456705 1.076573 -0.646309
H  -3.904867 2.400839 0.440518
H  -1.263664 -4.2682 -0.549149
H  -3.671644 -3.541885 -0.410958
H  3.555042 0.893758 2.306998
H  1.839833 1.3617 2.024244
H  3.180305 2.241744 1.224297
