program: Gaussian 09
title: 000268295
version: EM64L-G09RevD.01
frameworkgroup: C1[X(C8H10N2O)]
method: RPBEPBE
basis: SDD
operation: Freq
keyword: #p
keyword: freq=noraman
keyword: PBEPBE/SDD
title: #p freq=noraman PBEPBE/SDD
converged: YES YES NO NO
title: Mulliken charges:
elementType: O N N C C C C C C C C H H H H H H H H H H
charge: -0.252137 -0.398630 -0.059337 0.339553 0.062885 -0.314282 -0.798511 -0.175021 -0.344159 0.213640 -0.786357 0.240805 0.212857 0.222467 0.297535 0.324707 0.230740 0.240821 0.236509 0.264234 0.241682
chargesum: 0.00000
title: Mulliken charges with hydrogens summed into heavy atoms:
elementType: O N N C C C C C C C C
charge: -0.252137 -0.073923 -0.059337 0.339553 0.062885 -0.073477 -0.065652 0.055719 -0.103338 0.213640 -0.043933
polarizability: 1.43866918e+02 -3.03350263e+00 1.05469586e+02 5.55090568e+00 2.93141195e+00 5.85726983e+01
1716.lowfreq: -42.0721 -5.3834 -0.0007 -0.0006 -0.0005 6.9065 8.9769 70.6803 86.8148
frequency: -41.9434 70.6638 86.7867 133.6277 155.8752 211.2814 280.5408 289.6641 323.6181 412.7743 455.5072 513.7268 536.2474 571.2822 583.8005 636.9634 671.5394 734.6602 772.7899 796.6986 860.1504 927.5233 936.9535 973.3734 989.5848 993.3901 1032.5194 1053.8045 1058.9535 1114.5915 1181.0615 1231.1371 1254.7429 1278.2385 1341.0260 1375.1139 1398.8144 1411.2215 1429.5189 1449.4848 1451.3048 1466.6816 1476.4874 1489.2026 1567.0865 1587.4522 1640.5063 2980.8874 2990.5414 3065.7441 3077.7300 3089.8084 3132.8219 3136.1064 3139.5631 3171.4353 3494.2690
redmass: 1.0638 5.3611 3.1778 3.3886 1.3337 2.8108 3.8889 3.0960 3.6964 3.3130 3.5277 4.3260 3.1453 5.0684 2.6978 3.3992 1.6929 4.4121 5.2694 1.2567 4.4996 1.3496 4.9290 1.3804 1.4960 1.8426 1.6690 1.6108 2.3036 1.6753 1.7175 2.9120 2.8093 1.8230 5.5210 1.2412 1.2749 1.7695 2.0815 1.3835 1.1049 1.0515 1.2829 1.4646 4.8091 5.9946 6.0076 1.0365 1.0381 1.0963 1.0979 1.1003 1.0875 1.0987 1.0922 1.0999 1.0755
irintensity: 0.3819 4.4738 5.3141 6.0944 1.4041 6.1080 6.0236 1.0876 0.5048 3.5450 2.2952 8.6765 7.6585 8.6886 5.0323 17.3210 75.2267 8.5424 1.8151 66.7197 1.3512 1.4855 10.6162 0.2616 2.8158 10.2009 8.0603 5.4488 6.7632 21.6139 4.4295 68.5912 10.5266 45.2145 23.4720 56.0701 70.9862 4.1087 358.0211 22.9412 43.0668 20.8832 6.0041 175.5062 25.7263 16.8154 134.2794 24.7385 7.4809 12.6856 13.7535 14.4308 3.5230 8.4063 23.0029 27.0519 25.5245
temp: 298.150 k
press: 1.00000 atm
elementType: 8 7 7 6 6 6 6 6 6 6 6 1 1 1 1 1 1 1 1 1 1
symmnumber: 1
zpe: 439549.2 jmol-1
zpe.correction: 0.167415 hartree
zpe.thermalcorrener: 0.177291 hartree
zpe.thermalcorrenthalpy: 0.178235 hartree
zpe.thermalcorrgfe: 0.131956 hartree
zpe.sumelectzpe: -494.784870 hartree
zpe.sumelectthermal: -494.774995 hartree
zpe.sumelectthermalent: -494.774050 hartree
zpe.sumelectthermalfe: -494.820329 hartree
dipole: 0.6402 -0.6436 -2.0865
dipole: 2.2755
quadrupole: -53.5311 -63.5362 -68.8847
quadrupole: 7.5217 5.9314 -1.5878
quadrupole: 8.4529 -1.5522 -6.9007 7.5217 5.9314 -1.5878
hfenergy: -494.9522851 hartree
pointgroup: C01 [X(C8H10N2O1)]
dipole: -0.2002989 -0.1553832 -0.8585923 debye
dipolederiv: -0.5906701 -0.0102516 0.1377213 0.144126 -0.4289581 0.1677388 -0.3283929 0.255224 -0.920142 -1.5220043 0.4089809 -0.3771182 0.4173485 -0.4212362 -0.0013876 -0.4513356 0.087783 -0.5858985 -0.5511227 -0.0153666 0.0218663 0.1846357 -0.3694803 0.0759772 -0.080824 0.0852229 -0.2698753 -0.4123478 0.0455494 0.002381 -0.1531803 0.3070312 -0.0402215 0.2409871 -0.1387221 0.0345926 1.3477777 -0.3811437 0.1372474 -0.0766345 0.1210542 0.0046355 -0.2168904 0.0859658 0.0297036 0.2246569 0.0345636 -0.0716328 -0.0712431 0.0338561 -0.0976799 -0.0445088 -0.1260591 -0.0615522 0.0202602 0.1208902 -0.0597312 0.0591042 -0.1235704 0.068566 -0.061367 0.1020206 -0.036362 -0.0163858 -0.1067282 0.0080678 0.0906769 -0.2270332 0.05537 -0.075308 0.0987184 -0.1641895 0.1094033 0.07443 -0.097393 -0.1839477 0.2537304 -0.1831836 0.0172988 -0.2050155 0.019161 1.4928149 -0.2607236 0.1057067 -0.5757688 0.3932365 -0.3944302 0.6608707 -0.4516126 1.2392777 -0.4526573 0.0447946 0.0958965 0.0059841 0.0412405 0.0348718 0.1819705 0.0225089 -0.0370058 0.006104 -0.0586991 0.0564231 -0.0960147 0.0266277 0.0727896 0.0657674 0.0649601 0.0956898 -0.1065948 -0.1582462 0.059546 -0.0532641 -0.0030682 0.0302476 0.018827 0.0188364 0.112368 0.0486775 0.0704004 0.0952017 0.0459069 -0.0018324 -0.0172062 0.076565 -0.0892559 -0.0142501 0.1305415 0.037468 -0.0841274 0.0298984 0.0892529 -0.0125253 -0.059185 0.0229074 0.0283525 0.1622351 0.0085089 0.0044289 0.0386963 0.2239024 0.1187241 0.0849475 0.0342975 0.2269149 -0.0892033 0.0883732 0.0163469 0.0753452 0.0815367 0.0257158 0.0329736 0.0273136 0.1498844 0.0591437 0.0512056 -0.0114509 0.0856015 -0.0620644 0.0964527 -0.0249066 0.0992253 0.0855889 0.0510364 -0.0150952 -0.0214846 0.0307318 0.0653642 -0.0931371 0.0257321 -0.0951252 -0.0648993 0.0317201 0.0414174 -0.0342145 0.0812423 0.0791823 0.0588769 -0.0865763 0.071744 0.0210697 0.0566146 -0.0203282 0.0163189 -0.0792448 -0.0787719 0.0298055 0.0233549 0.0290626 0.1115719 unknown
polarizability: 137.1322415|-17.5126418|96.6804917|-1.3624453|-23.3425235|74.0964694 unknown
InChI: InChI=1S/C8H10N2O/c1-6-4-3-5-9-8(6)10-7(2)11/h3-5,10H,1-2H3
charge 0 multiplicity 1
21 atoms
O  1.760064 -1.119956 1.591319
N  1.211052 -0.291817 -0.540352
N  -0.508557 1.209017 -0.964337
C  -1.119054 -0.859257 0.233092
C  -0.174645 0.01647 -0.384782
C  -2.446891 -0.366547 0.319271
C  -0.781341 -2.256527 0.69893
C  -2.800377 0.886985 -0.225979
C  -1.800276 1.62794 -0.892461
C  2.104546 -0.781189 0.424465
C  3.5516 -0.84547 -0.066103
H  -3.209899 -0.992688 0.795679
H  -1.701062 -2.834132 0.894372
H  -0.188408 -2.793486 -0.065299
H  -0.160908 -2.230687 1.611562
H  1.625177 0.198475 -1.340856
H  -3.824955 1.265464 -0.164693
H  -2.024205 2.582358 -1.381288
H  3.63293 -1.384689 -1.026856
H  4.158289 -1.360805 0.692129
H  3.959821 0.172942 -0.207915
