program: Gaussian 09
title: 000268293
version: EM64L-G09RevD.01
frameworkgroup: C1[X(C12H13NO)]
method: RPBEPBE
basis: SDD
operation: Freq
keyword: #p
keyword: freq=noraman
keyword: PBEPBE/SDD
title: #p freq=noraman PBEPBE/SDD
converged: NO YES NO NO
title: Mulliken charges:
elementType: O N C C C C C C C C C C C C H H H H H H H H H H H H H
charge: -0.272150 -0.428846 0.270581 0.112026 0.262849 0.105749 0.355592 -0.033691 -0.400621 -0.844501 -0.420867 -0.269254 -0.838360 -0.843549 0.349202 0.245222 0.260852 0.239088 0.239075 0.233545 0.227313 0.227150 0.285815 0.227117 0.241347 0.234641 0.234673
chargesum: 0.00000
title: Mulliken charges with hydrogens summed into heavy atoms:
elementType: O N C C C C C C C C C C C C
charge: -0.272150 -0.079644 0.270581 0.112026 0.262849 0.105749 0.355592 -0.033691 -0.155399 -0.105486 -0.187322 -0.041941 -0.098277 -0.132886
polarizability: 2.04187562e+02 -1.54872191e+01 1.62844680e+02 9.18678243e-03 -2.61329276e-03 6.94016332e+01
1716.lowfreq: -9.6759 -8.4147 -0.0003 -0.0001 0.0005 8.1401 77.0449 97.0248 132.4001
frequency: 77.0383 97.0149 132.3936 149.4880 176.0810 183.3880 207.5341 216.6156 291.4868 316.2762 329.3900 335.3450 372.4586 425.2833 446.2324 483.8319 516.0191 549.1359 562.1386 583.7583 604.6395 679.2545 697.1088 744.3684 770.5435 779.6073 797.0512 866.9698 896.7306 907.3584 970.5322 975.2434 1010.5966 1023.1304 1044.4994 1052.3193 1074.3303 1101.3285 1117.2876 1181.3669 1196.1850 1264.0489 1277.7026 1283.8699 1360.4859 1372.6324 1391.8793 1396.4028 1397.9739 1420.1335 1450.0426 1465.0579 1471.1255 1473.2627 1476.7304 1482.3024 1491.7128 1498.0127 1569.0927 1606.4020 1608.4765 1628.7056 2960.2893 2977.6699 2979.5581 3030.3100 3049.8163 3054.8038 3090.1354 3100.0750 3120.8729 3127.5770 3147.3051 3168.8152 3521.2250
redmass: 3.6919 2.6553 1.6923 1.7645 1.0816 1.1557 2.6603 3.4415 3.3132 3.2348 4.3239 2.6335 5.5838 6.2412 4.3669 3.5794 5.5337 3.3324 5.2266 3.0313 4.1566 5.7853 1.6813 2.4079 1.9771 3.7734 2.2825 3.6128 2.9025 1.3576 1.3302 1.8034 1.6345 1.4405 1.5239 1.6022 2.1168 2.1464 2.2668 1.3910 3.2170 1.9336 3.2158 2.8877 2.5442 2.5515 1.3380 1.2928 1.4069 2.8407 1.3361 2.1790 1.9021 1.0472 1.0442 1.1233 1.5118 1.0462 6.6122 5.4975 5.7867 6.1092 1.0394 1.0378 1.0403 1.0978 1.0968 1.0978 1.0958 1.0974 1.0949 1.0877 1.0904 1.0980 1.0760
irintensity: 3.7799 0.2271 0.0124 0.0394 2.8356 0.0793 0.5059 0.1603 7.1075 2.8804 1.2323 1.2638 7.9222 1.1196 5.8375 0.8990 7.8793 1.8073 2.2430 1.3213 3.6051 4.9405 24.6188 0.2010 118.2465 3.4564 12.9450 0.5825 0.9126 0.0040 0.4727 5.5567 1.2997 2.9495 6.4358 0.0001 17.8159 13.1498 20.9620 8.2927 21.8569 2.2552 8.9743 3.0931 47.7256 19.2471 14.1761 12.0671 42.2739 12.5305 0.8004 20.8330 3.6064 26.9952 15.3855 15.1939 24.4787 1.7964 71.2254 98.8683 37.2010 314.4298 29.4238 30.3847 17.9990 19.3620 18.5183 16.7793 15.3747 3.2840 17.2494 8.8910 14.5652 22.6559 31.9023
temp: 298.150 k
press: 1.00000 atm
elementType: 8 7 6 6 6 6 6 6 6 6 6 6 6 6 1 1 1 1 1 1 1 1 1 1 1 1 1
symmnumber: 1
zpe: 578130.5 jmol-1
zpe.correction: 0.220198 hartree
zpe.thermalcorrener: 0.232984 hartree
zpe.thermalcorrenthalpy: 0.233929 hartree
zpe.thermalcorrgfe: 0.181946 hartree
zpe.sumelectzpe: -594.090596 hartree
zpe.sumelectthermal: -594.077810 hartree
zpe.sumelectthermalent: -594.076866 hartree
zpe.sumelectthermalfe: -594.128848 hartree
dipole: -2.9489 2.7777 0.0011
dipole: 4.0512
quadrupole: -78.7747 -81.1473 -86.0826
quadrupole: 13.8170 0.0033 -0.0051
quadrupole: 3.2268 0.8542 -4.0811 13.8170 0.0033 -0.0051
hfenergy: -594.3107945 hartree
pointgroup: C01 [X(C12H13N1O1)]
dipole: 1.2469017 0.9922233 0.0332116 debye
polarizability: 206.4603944|11.8272213|160.4991549|1.1305588|2.4867032|69.4743264 unknown
InChI: InChI=1S/C12H13NO/c1-7-5-4-6-10-8(2)9(3)12(14)13-11(7)10/h4-6,13H,1-3H3
charge 0 multiplicity 1
27 atoms
O  -2.445979 -2.264394 -0.080227
N  -0.259011 -1.493557 -0.047922
C  0.310044 0.861327 0.017879
C  0.72795 -0.508466 -0.015764
C  -1.122512 1.169715 0.01737
C  -2.068663 0.148983 -0.014591
C  2.11028 -0.875503 -0.01707
C  -1.650081 -1.2688 -0.0501
C  1.31934 1.867021 0.051091
C  -1.543653 2.62723 0.052821
C  3.066475 0.157411 0.016812
C  2.67995 1.52322 0.050891
C  -3.56695 0.377803 -0.016224
C  2.523515 -2.335658 -0.054358
H  0.010053 -2.481362 -0.072358
H  1.028686 2.921431 0.077412
H  -2.637471 2.736602 0.048455
H  -1.143468 3.177346 -0.820166
H  -1.155077 3.130966 0.95846
H  4.131016 -0.105119 0.016501
H  3.446174 2.304836 0.076882
H  -3.900421 0.918839 0.889123
H  -4.078014 -0.597851 -0.044728
H  -3.891679 0.966337 -0.894735
H  3.621746 -2.429138 -0.050378
H  2.143614 -2.897806 0.822186
H  2.154236 -2.84881 -0.964862
