program: Gaussian 09
title: 000268292
version: EM64L-G09RevD.01
frameworkgroup: C1[X(C11H11Br2NO)]
method: RPBEPBE
basis: SDD
operation: Freq
keyword: #p
keyword: freq=noraman
keyword: PBEPBE/SDD
title: #p freq=noraman PBEPBE/SDD
converged: YES YES NO NO
title: Mulliken charges:
elementType: Br Br O N C C C C C C C C C C C H H H H H H H H H H H
charge: -0.031154 0.020050 -0.219857 -0.178340 -0.222096 -0.634225 0.467015 0.278201 0.222566 -0.691984 -0.355371 -0.350586 -0.653609 -0.269169 -0.233495 0.367798 0.250006 0.248290 0.254188 0.238460 0.255076 0.237731 0.243822 0.285727 0.236415 0.234538
chargesum: 0.00000
title: Mulliken charges with hydrogens summed into heavy atoms:
elementType: Br Br O N C C C C C C C C C C C
charge: -0.031154 0.020050 -0.219857 -0.178340 -0.222096 -0.266427 0.467015 0.278201 0.222566 0.060500 -0.116911 -0.095510 0.113672 -0.032753 0.001043
polarizability: 1.75059128e+02 1.21543178e+01 1.71608782e+02 1.26841738e+01 7.26539640e+00 1.58875153e+02
1716.lowfreq: -13.1757 -7.7712 -0.0006 -0.0005 -0.0003 5.4489 50.7956 66.9296 89.7921
frequency: 50.7801 66.9140 89.7918 102.1732 124.1793 138.3240 172.1991 226.2327 231.9666 243.7450 266.7449 286.7473 305.9725 338.8594 379.7914 406.0620 428.7597 449.3981 492.2873 509.7646 542.9955 561.7555 620.7667 654.8008 696.7541 721.9477 760.5942 766.0545 774.3214 869.6974 898.2147 950.9689 965.0071 987.2726 1030.7104 1043.3718 1054.5669 1069.1876 1122.4406 1133.0375 1143.4066 1163.9668 1182.2229 1184.7525 1254.1161 1284.3158 1300.4794 1320.6348 1337.8116 1388.9359 1395.4201 1426.7716 1449.2701 1462.4710 1471.2784 1478.7490 1492.1363 1500.0952 1585.6398 1601.3963 1619.6356 2992.4488 2999.1328 3081.4355 3096.9067 3114.7136 3128.0207 3139.2613 3140.1182 3153.8567 3170.6686 3182.1567
redmass: 7.2040 5.5031 8.1742 10.2171 3.5114 10.6947 23.0714 3.4876 1.1206 2.2587 2.5356 1.5551 3.4447 4.0159 4.4173 5.9598 4.1673 6.3992 5.9834 4.7863 3.8361 3.9226 4.3257 6.1432 5.4073 6.8072 2.7962 1.5629 3.7969 1.4943 2.9134 1.3926 2.2719 1.3337 2.2970 2.2218 3.1535 2.3216 1.3251 1.5848 1.6134 1.3726 1.3105 1.5269 2.1539 2.5428 3.3675 2.2124 2.5681 8.4312 1.1950 1.2335 1.8334 1.1728 1.2058 1.1950 1.6225 1.1598 6.9706 8.0245 6.9121 1.0356 1.0372 1.1013 1.0977 1.1004 1.0993 1.0885 1.0861 1.0902 1.0956 1.0973
irintensity: 0.1785 2.1133 1.2627 0.7050 1.0163 1.1712 5.1657 0.3882 0.1678 7.4930 2.6127 1.0791 0.6948 1.6965 9.4330 6.3034 25.2321 12.1386 73.7744 23.9441 4.9086 31.0559 18.2609 7.6246 13.9000 5.5512 23.3319 51.5346 2.2184 2.0589 14.2903 0.8610 6.0122 0.0964 27.1294 19.4135 12.7137 6.9770 2.1935 2.2316 26.0330 17.7704 1.3947 2.5849 5.8707 25.4227 46.8624 29.9713 107.2875 10.7179 22.5943 22.3684 44.1873 1.9919 44.0029 87.0638 34.8785 9.7970 31.7591 360.2733 11.6660 36.4020 6.5286 18.1410 9.2287 11.4480 0.9744 0.2199 1.9465 9.1907 20.9503 10.8461
temp: 298.150 k
press: 1.00000 atm
elementType: 35 35 8 7 6 6 6 6 6 6 6 6 6 6 6 1 1 1 1 1 1 1 1 1 1 1
symmnumber: 1
zpe: 513062.7 jmol-1
zpe.correction: 0.195415 hartree
zpe.thermalcorrener: 0.209911 hartree
zpe.thermalcorrenthalpy: 0.210856 hartree
zpe.thermalcorrgfe: 0.152881 hartree
zpe.sumelectzpe: -581.601603 hartree
zpe.sumelectthermal: -581.587107 hartree
zpe.sumelectthermalent: -581.586163 hartree
zpe.sumelectthermalfe: -581.644137 hartree
dipole: -3.7836 -2.0956 -2.0668
dipole: 4.7937
quadrupole: -107.7224 -106.3416 -101.3452
quadrupole: 9.0669 -4.9570 -8.4485
quadrupole: -2.5860 -1.2052 3.7912 9.0669 -4.9570 -8.4485
hfenergy: -581.7970183 hartree
pointgroup: C01 [X(C11H11Br2N1O1)]
dipole: 1.862373 0.0830584 -0.2856365 debye
dipolederiv: -0.3229553 -0.111809 0.050533 -0.0306659 -0.2260792 0.102252 0.3034408 0.2949404 -0.9581048 -0.1143852 0.0159386 -0.0512192 -0.0224526 -0.1590855 -0.0143312 -0.1879945 -0.034944 -0.7313234 -1.2749399 0.1415928 -0.0126452 0.3318063 -0.5573007 -0.0878663 0.098532 -0.0673094 -0.3016449 -1.4341424 0.289784 -0.0825311 -0.2350416 -0.5557191 -0.1022017 -0.0454714 -0.1022275 -0.1881726 0.5817379 0.3941936 -0.2130269 0.1640735 0.4397065 -0.1238681 -0.4382047 -0.2616525 0.9817719 0.0258881 -0.042007 0.1336444 0.0548663 -0.1161967 -0.151234 0.3399105 -0.0457109 0.8950914 -0.3824617 -0.2181972 0.1064324 0.0951507 -0.3296751 0.052299 -0.0291034 -0.0909266 -0.1182234 0.9583397 -0.5175914 0.0538723 -0.3176223 0.1716336 -0.0856677 -0.0950266 0.0394741 0.0811015 1.8543506 -0.0028279 0.0849827 0.2765245 0.6208412 0.3259796 -0.0445449 0.1614144 0.1670372 -0.0019052 0.0417714 0.0271884 0.0070306 -0.153161 0.0065734 0.0202733 -0.0517556 -0.1051872 0.1588137 0.1661859 -0.095214 -0.0810066 0.0832105 0.0120858 0.0233218 -0.0032285 -0.1054269 -0.4052284 0.1762323 -0.0053345 -0.0953368 0.0744647 -0.0089058 -0.0041331 -0.0164229 -0.1735999 -0.0323352 -0.0174618 -0.0146085 -0.0088851 0.4496732 0.0098982 0.0732592 0.0244445 0.2101555 -0.0490438 -0.1337579 -0.0027605 -0.14188 -0.2697828 0.0788592 -0.0208965 0.0220923 -0.1578043 0.1425545 -0.0658477 0.0010776 0.0663779 0.2065007 -0.0409335 -0.0350335 0.0003112 -0.1267084 0.0385268 -0.0340217 -0.0222156 -0.016391 0.0630693 -0.0165693 0.0045352 0.0126804 -0.0522826 0.0881207 0.0068998 0.0481493 0.0035775 0.0774971 -0.0208562 0.052945 -0.0211153 -0.0729003 -0.0039217 0.087551 -0.075374 0.0487578 0.0619411 0.0205442 -0.0724567 0.0507844 0.0445349 -0.0654814 -0.1154401 0.0169186 -0.0464828 0.0581349 -0.0126756 0.027161 0.0172335 0.0938166 0.1147856 0.0064039 0.0024871 0.0300887 -0.0752407 0.0012464 0.0006247 0.0096785 0.1173229 0.1018513 0.028338 0.0046302 0.0090286 -0.078319 0.0087602 0.0030425 0.0088702 0.1516038 0.0930812 -0.0999096 0.060489 -0.0389385 -0.0368259 0.0241595 0.041848 0.0938016 -0.0539259 0.0419419 -0.0961391 -0.1171711 -0.010078 0.0203543 -0.0034474 -0.0866518 -0.0399435 -0.0264768 0.0168312 0.1289416 0.047914 -0.0181983 0.1541421 0.0172352 0.0187123 0.0001728 0.1215611 -0.0817812 0.0612184 0.0282155 0.0810205 0.0508422 -0.0063799 0.021453 -0.0105913 0.1609198 -0.0482419 -0.090041 0.025566 -0.1053233 0.0253743 0.0150441 0.0304577 0.0099296 0.1468649 unknown
polarizability: 189.0366244|3.4073037|155.8972787|-8.2142536|-5.7928196|160.6091606 unknown
InChI: InChI=1S/C11H11Br2NO/c1-11(13)7-5-3-4-6-8(7)14(2)10(15)9(11)12/h3-6,9H,1-2H3
charge 0 multiplicity 1
26 atoms
Br -0.938494 -1.456008 2.317019
Br -1.694906 -0.790457 -2.404305
O  -2.978882 1.26201 0.226646
N  -0.641517 1.428797 0.155275
C  -0.482615 -1.457184 0.200524
C  -1.726474 -0.747791 -0.33023
C  0.750105 -0.622207 0.02409
C  0.62936 0.806025 0.002899
C  -1.850767 0.722661 0.052094
C  -0.392967 -2.940535 -0.16006
C  2.033252 -1.204539 -0.102754
C  1.796637 1.600161 -0.136387
C  -0.726483 2.880067 0.423611
C  3.188432 -0.412282 -0.249244
C  3.06285 0.995155 -0.262161
H  -2.662127 -1.267944 -0.088094
H  -0.106592 -3.051355 -1.221811
H  0.347786 -3.461557 0.466571
H  -1.368004 -3.431267 -0.007086
H  2.130009 -2.294088 -0.084921
H  1.722942 2.68996 -0.156886
H  -0.407432 3.464601 -0.458329
H  -0.099591 3.146841 1.291378
H  -1.778672 3.114016 0.641859
H  4.171095 -0.883165 -0.349649
H  3.95085 1.626484 -0.37385
