program: Gaussian 09
title: 000268283
version: EM64L-G09RevD.01
frameworkgroup: C1[X(C14H13NO4)]
method: RPBEPBE
basis: SDD
operation: Freq
keyword: #p
keyword: freq=noraman
keyword: PBEPBE/SDD
title: #p freq=noraman PBEPBE/SDD
converged: YES YES NO NO
title: Mulliken charges:
elementType: O O O O N C C C C C C C C C C C C C C H H H H H H H H H H H H H
charge: -0.248615 -0.266568 -0.237189 -0.200017 -0.230258 0.267425 0.223037 -0.536052 0.325428 0.164936 -0.337517 -0.447976 -0.372214 -0.249485 -0.260632 0.275875 -0.168746 -0.223975 -0.670736 0.297447 0.273923 0.268995 0.252571 0.300132 0.236657 0.238644 0.176353 0.234921 0.229939 0.214122 0.232694 0.236881
chargesum: 0.00000
title: Mulliken charges with hydrogens summed into heavy atoms:
elementType: O O O O N C C C C C C C C C C C C C C
charge: -0.248615 -0.266568 -0.237189 -0.200017 -0.230258 0.267425 0.223037 0.035319 0.325428 0.164936 -0.068522 -0.195405 -0.072082 -0.012828 -0.021988 0.275875 0.007607 0.240885 0.012961
polarizability: 1.96595781e+02 -4.73131679e+00 2.09932947e+02 -3.27495275e+01 6.34547418e+00 1.19206352e+02
1716.lowfreq: -4.4353 -0.0004 0.0003 0.0005 4.2041 7.6271 22.3013 33.4633 45.3032
frequency: 22.2957 33.4132 45.2993 57.2928 70.3955 110.7873 119.5420 143.7179 161.9772 208.2448 210.3325 246.2004 258.0637 302.0417 311.8459 339.1401 367.5962 370.3102 414.5737 425.0044 459.5600 500.7491 513.2407 535.3721 560.2119 588.7681 647.1311 658.0062 695.1905 710.4645 755.4161 769.0579 774.1954 782.3592 798.2717 814.6758 880.7694 892.9485 902.6673 917.0678 974.8788 981.8595 1005.2822 1015.5084 1023.7792 1043.8169 1064.3486 1102.2058 1114.2463 1134.8754 1165.6667 1174.5850 1187.4491 1199.2080 1232.7843 1250.1171 1282.1484 1303.6363 1314.1052 1358.0656 1363.6020 1373.5283 1396.0308 1401.9843 1415.1613 1441.8715 1452.2085 1462.5776 1472.8704 1485.6963 1495.8042 1543.1347 1565.4217 1609.5811 1619.9916 1628.0498 1631.2521 2883.4098 2996.0375 2998.0677 3013.7943 3073.9211 3085.0166 3094.6554 3111.3742 3140.2683 3155.6857 3159.6340 3174.5585 3184.1304
redmass: 3.8901 5.8862 3.8495 3.9570 6.4751 6.5351 3.3928 2.6547 4.0607 4.1820 7.3259 1.3055 3.7067 8.9810 4.1026 5.0077 3.6828 5.2960 3.5242 3.3733 9.7103 6.4920 4.3540 3.8339 5.4204 3.9905 6.3498 4.1117 4.3660 5.6884 5.6388 4.4487 1.2876 4.5225 1.1044 4.6261 1.4270 1.4716 3.4535 4.1381 1.3571 1.8282 1.3222 2.9934 2.8033 4.8743 2.1798 4.2219 2.2942 1.4629 1.8205 1.8616 1.8097 1.8213 1.7056 1.1383 1.5594 2.5448 1.5426 1.3940 1.6506 2.8221 3.8174 1.2628 1.4870 2.6304 1.1004 1.0397 1.0668 1.0667 3.0375 7.5528 6.7221 7.3614 6.8352 8.1872 9.2087 1.0853 1.0633 1.0363 1.0582 1.1068 1.0968 1.0985 1.1029 1.0869 1.0916 1.0915 1.0951 1.0979
irintensity: 0.7529 0.5535 0.2674 1.4173 0.3306 12.6716 0.9286 4.8325 1.2153 8.8584 10.1618 0.5038 0.0432 8.9919 2.3155 4.8548 4.0484 7.2740 4.8545 4.7940 6.2337 11.9034 6.3963 6.6080 3.8736 0.1299 4.4559 3.2871 4.5298 12.4971 30.1967 0.9077 98.1885 10.3548 3.7402 4.4743 1.5308 21.2536 20.3160 43.6313 6.9385 3.3833 0.5520 9.7106 89.8360 20.7692 29.4586 1.5663 5.7501 5.8987 10.2606 26.7032 147.4605 96.6909 65.2570 0.4166 3.5097 30.4582 21.5275 0.5418 28.0259 10.4934 1.8938 22.0837 19.8655 101.2718 39.7163 13.6852 5.2359 13.6694 0.9351 25.6963 120.3084 290.0186 32.3116 108.5012 242.2174 109.2957 37.1724 16.9959 17.5231 5.8779 7.4925 27.6344 34.5841 4.6389 0.4284 14.1899 2.9363 16.2634
temp: 298.150 k
press: 1.00000 atm
elementType: 8 8 8 8 7 6 6 6 6 6 6 6 6 6 6 6 6 6 6 1 1 1 1 1 1 1 1 1 1 1 1 1
symmnumber: 1
zpe: 638399.6 jmol-1
zpe.correction: 0.243154 hartree
zpe.thermalcorrener: 0.260419 hartree
zpe.thermalcorrenthalpy: 0.261363 hartree
zpe.thermalcorrgfe: 0.196185 hartree
zpe.sumelectzpe: -895.585455 hartree
zpe.sumelectthermal: -895.568189 hartree
zpe.sumelectthermalent: -895.567245 hartree
zpe.sumelectthermalfe: -895.632423 hartree
dipole: 0.6768 1.8353 1.5018
dipole: 2.4662
quadrupole: -121.6743 -108.2252 -108.1740
quadrupole: 0.8549 12.4905 -3.2266
quadrupole: -8.9831 4.4660 4.5171 0.8549 12.4905 -3.2266
hfenergy: -895.8286082 hartree
pointgroup: C01 [X(C14H13N1O4)]
dipole: -0.1743621 -0.7124889 0.6351052 debye
polarizability: 201.8280105|-4.7636853|208.8222478|26.9724771|-7.6175469|115.084822 unknown
InChI: InChI=1S/C14H13NO4/c1-2-19-14(18)8-15-12-6-4-3-5-11(12)10(9-16)7-13(15)17/h3-7,9H,2,8H2,1H3
charge 0 multiplicity 1
32 atoms
O  -2.477086 0.132913 0.805388
O  -0.879537 2.688333 -1.338268
O  -3.645315 -1.243786 -0.672147
O  4.450964 0.907068 0.858596
N  -0.404673 0.405314 -1.014613
C  0.466401 -0.630971 -0.615563
C  1.782952 -0.313447 -0.123456
C  -1.760444 0.09986 -1.499437
C  2.164261 1.093237 -0.048206
C  -0.06178 1.790343 -0.957313
C  0.058494 -1.992246 -0.698971
C  1.27523 2.076642 -0.449752
C  2.648641 -1.377384 0.267067
C  0.935076 -3.017618 -0.307273
C  2.233324 -2.714603 0.177031
C  -2.721844 -0.432049 -0.432894
C  3.48459 1.596224 0.441737
C  -3.400795 -0.272924 1.916558
C  -2.937249 0.471288 3.162901
H  -2.166976 1.060074 -1.873476
H  -1.739363 -0.622571 -2.33138
H  -0.935945 -2.258666 -1.065881
H  1.539949 3.138535 -0.404085
H  3.644387 -1.124089 0.637906
H  0.604888 -4.059502 -0.379659
H  2.909642 -3.520016 0.479664
H  3.563904 2.712116 0.411083
H  -4.430211 -0.00698 1.6165
H  -3.34241 -1.370842 2.025554
H  -3.591988 0.213108 4.015066
H  -1.901326 0.196812 3.424761
H  -2.981161 1.562629 3.008662
