program: Gaussian 09
title: 000268277
version: EM64L-G09RevD.01
frameworkgroup: C1[X(C9H10N2O2)]
method: RPBEPBE
basis: SDD
operation: Freq
keyword: #p
keyword: freq=noraman
keyword: PBEPBE/SDD
title: #p freq=noraman PBEPBE/SDD
converged: YES YES NO NO
title: Mulliken charges:
elementType: O O N N C C C C C C C C C H H H H H H H H H H
charge: -0.242088 -0.251732 -0.453300 -0.000324 -0.622932 0.174954 0.467542 0.285994 -0.352068 -0.428876 -0.762728 -0.151942 -0.356803 0.274913 0.269243 0.358233 0.243167 0.313630 0.252887 0.263456 0.245988 0.230715 0.242072
chargesum: 0.00000
title: Mulliken charges with hydrogens summed into heavy atoms:
elementType: O O N N C C C C C C C C C
charge: -0.242088 -0.251732 -0.095067 -0.000324 -0.078776 0.174954 0.467542 0.285994 -0.108901 -0.115246 -0.000397 0.078773 -0.114731
polarizability: 1.77041497e+02 -1.23698332e+01 1.20878745e+02 2.21184958e+00 2.61268681e+00 5.86374132e+01
1716.lowfreq: -6.8947 -5.8007 -0.0003 0.0003 0.0005 10.1001 27.6792 55.6397 69.4901
frequency: 27.6288 55.6276 69.4869 100.0437 110.5711 143.0261 211.2512 252.7959 281.1831 331.3204 378.8572 404.4941 447.1792 507.4439 520.0047 566.5349 592.6539 611.8159 705.0452 717.2604 808.5549 817.6368 825.2877 879.1958 895.0853 917.1161 930.8142 948.8413 974.7799 979.7934 997.1084 1024.6086 1032.0898 1120.9412 1164.1529 1179.9448 1195.9891 1213.6038 1271.3594 1309.2323 1318.8046 1333.0246 1374.2558 1412.7743 1416.3778 1439.7240 1451.6337 1460.4746 1528.8066 1579.4135 1589.5197 1605.5998 1646.6991 2972.7944 2983.1391 3065.8561 3080.6168 3124.8543 3128.7328 3136.0106 3164.7445 3190.4245 3268.5354
redmass: 3.2724 4.7620 3.2857 6.1757 3.6438 1.2108 6.9495 3.9353 3.7437 6.5047 4.1983 3.2680 2.5250 3.7811 4.5990 4.1124 4.4556 7.1087 5.4972 1.9575 1.7128 2.0288 4.8351 2.0784 1.4344 1.3421 4.2164 1.4395 1.3833 1.9233 3.9394 1.8401 2.7296 1.5483 1.7067 1.6210 1.3674 3.0155 2.5214 2.5268 3.2919 1.2858 1.2464 1.5183 1.4090 1.0754 1.0572 2.3936 3.1012 3.1512 5.3775 7.1691 3.2645 1.0672 1.0390 1.0950 1.0908 1.0890 1.1004 1.0907 1.0996 1.0938 1.0811
irintensity: 2.4559 3.6418 9.4697 5.6078 1.1888 0.6638 11.5098 0.0540 2.1691 3.0416 3.2553 3.3962 1.6664 4.3795 30.7926 5.0785 7.3661 0.6632 2.3088 35.9513 15.2804 17.6517 13.5008 31.5409 44.5893 9.8369 3.3771 19.1678 1.9276 14.9169 4.2899 21.3066 0.3458 17.9280 23.6965 3.9985 2.7986 110.2388 23.9479 92.2691 17.4731 15.9288 79.3642 133.9628 8.0734 24.7616 20.4336 58.7562 242.1152 399.6726 11.4393 17.8613 193.0957 1.6276 0.8050 7.6673 5.5586 4.5727 9.2883 16.8993 27.6780 1.5429 326.6055
temp: 298.150 k
press: 1.00000 atm
elementType: 8 8 7 7 6 6 6 6 6 6 6 6 6 1 1 1 1 1 1 1 1 1 1
symmnumber: 1
zpe: 465306.5 jmol-1
zpe.correction: 0.177226 hartree
zpe.thermalcorrener: 0.189416 hartree
zpe.thermalcorrenthalpy: 0.190360 hartree
zpe.thermalcorrgfe: 0.137166 hartree
zpe.sumelectzpe: -607.968397 hartree
zpe.sumelectthermal: -607.956207 hartree
zpe.sumelectthermalent: -607.955263 hartree
zpe.sumelectthermalfe: -608.008457 hartree
dipole: -5.0781 -3.3046 -0.6135
dipole: 6.0896
quadrupole: -60.5614 -85.4687 -76.3138
quadrupole: -12.7181 -1.0009 -0.9870
quadrupole: 13.5532 -11.3541 -2.1991 -12.7181 -1.0009 -0.9870
hfenergy: -608.1456227 hartree
pointgroup: C01 [X(C9H10N2O2)]
dipole: 1.8981547 1.4592548 0.087419 debye
dipolederiv: -0.6143422 -0.189248 -0.0229826 0.3211743 -1.0008352 -0.2098708 0.1566272 -0.108866 -0.3914629 -0.9057651 0.1168876 0.0076205 0.0233201 -0.7229882 -0.1493857 -0.0708953 -0.1607082 -0.3689227 -1.7533835 0.3092961 0.265928 0.2826404 -0.6034368 -0.1353957 0.2996336 -0.105086 -0.3634581 -0.2726321 -0.0780097 -0.0195334 -0.0002518 -0.2659381 -0.0052055 0.0032385 0.0078457 -0.2441889 -0.5307611 -0.2569484 -0.0654475 -0.3767389 -0.2437398 -0.1629505 -0.0320461 -0.2313622 -0.1151584 1.5200108 0.0742139 -0.1664133 -0.7420823 1.3125864 0.3335904 -0.5304074 0.2182603 0.2945968 1.2326287 -0.1865984 -0.2052659 0.153567 -0.1227575 -0.0953935 -0.1472901 -0.0321975 0.1673034 1.1261595 -0.0761852 0.2133194 0.1025876 0.8094796 0.331458 0.4195101 0.3815619 0.3601425 -0.1474656 0.0254763 -0.0037742 0.1881018 0.0610981 0.0279978 0.0417385 0.0559385 -0.1647147 -0.1459776 0.1262381 0.0354602 -0.2630386 0.163128 0.1057843 -0.0532641 0.0387658 -0.0747257 -0.5606445 0.0196641 -0.1331281 0.100987 -0.0069289 0.0204597 -0.2528337 -0.0242457 -0.0243103 -0.0837915 -0.0180605 -0.0077354 -0.1979001 0.0497857 0.0711403 -0.0555046 0.0416057 -0.0834847 0.2246103 -0.0086633 -0.0592001 0.1367301 0.0333241 0.0098683 -0.0197992 0.0341702 -0.0903621 0.1058047 -0.0006425 0.0161406 -0.0333579 0.0825568 0.0454653 0.0290881 0.0265258 0.0117102 -0.0286501 0.028959 -0.0367297 0.0712756 0.0150241 0.0095565 -0.0477654 0.0428745 0.1251715 0.5573277 0.1083547 0.0436191 0.2832774 0.2335904 -0.0190347 0.1200059 -0.0200478 0.2713851 0.0293754 -0.1074619 -0.0036402 -0.0957204 -0.0066766 -0.0260857 0.0006509 -0.0245567 0.1521729 0.1339857 0.0421514 0.0170288 0.0567517 0.077349 -0.0268663 0.0176722 -0.0254488 0.1457141 0.088236 -0.0203074 0.0083667 -0.0188266 0.0260964 0.0964768 -0.0283698 0.0836661 0.0417398 0.0500089 -0.0227635 -0.0148803 -0.0900605 -0.0405126 -0.0616299 -0.0357842 -0.0612157 0.1072753 0.0707001 0.0209279 0.0423418 -0.0055345 0.1044086 -0.0786626 0.0917063 -0.057145 -0.0280638 0.0338706 0.0745247 0.0386142 0.1039222 -0.0449969 -0.0673454 0.0471744 -0.0635043 0.1354799 -0.1293054 0.0181949 0.0502915 -0.0008237 0.0903835 -0.0139711 0.0469143 -0.0168307 0.1361609 unknown
polarizability: 177.0890185|-5.0492381|114.4401653|-14.2013716|17.0740982|65.0284713 unknown
InChI: InChI=1S/C9H10N2O2/c1-7(12)5-9(13)11-8-3-2-4-10-6-8/h2-4,6,11H,5H2,1H3
charge 0 multiplicity 1
23 atoms
O  0.771614 -1.996902 -0.94172
O  2.367849 1.845297 0.112798
N  0.221412 0.225864 -0.383462
N  -3.287862 -1.098715 -0.105481
C  2.560473 -0.347315 -0.964541
C  1.091811 -0.788118 -0.745457
C  -1.17681 0.138673 -0.158567
C  3.104417 0.863072 -0.20264
C  -1.855131 1.319025 0.249443
C  -1.941453 -1.054418 -0.322293
C  4.578751 0.841682 0.146039
C  -3.244152 1.271186 0.47358
C  -3.922758 0.044509 0.284408
H  2.664887 -0.117638 -2.047378
H  3.189913 -1.234928 -0.785392
H  0.679729 1.14086 -0.210323
H  -1.298401 2.253789 0.387974
H  -1.456097 -1.982694 -0.629122
H  4.756881 0.096335 0.945922
H  4.905976 1.83099 0.499737
H  5.187345 0.527072 -0.72166
H  -3.791756 2.16489 0.788991
H  -5.003234 -0.03632 0.447048
