program: Gaussian 09
title: 000022885
version: EM64L-G09RevD.01
frameworkgroup: C1[X(C18H23NO2)]
method: RPBEPBE
basis: SDD
operation: Freq
keyword: #p
keyword: freq=noraman
keyword: PBEPBE/SDD
title: #p freq=noraman PBEPBE/SDD
converged: NO YES NO NO
title: Mulliken charges:
elementType: O O N C C C C C C C C C C C C C C C C C C H H H H H H H H H H H H H H H H H H H H H H H
charge: -0.423335 -0.201989 -0.081679 0.148073 -0.492633 -0.433974 0.384550 -0.420832 0.056983 0.151818 -0.724064 -0.402699 0.403426 -0.347871 -0.283023 -0.467712 -0.620383 -0.619088 -0.439053 -0.309911 -0.248066 0.250175 0.230072 0.233638 0.227490 0.208206 0.225350 0.217631 0.239190 0.219635 0.252358 0.254703 0.226711 0.239368 0.231244 0.190219 0.219947 0.222096 0.187165 0.226211 0.237920 0.375969 0.226954 0.229214
chargesum: 0.00000
title: Mulliken charges with hydrogens summed into heavy atoms:
elementType: O O N C C C C C C C C C C C C C C C C C C
charge: -0.047366 -0.201989 -0.081679 0.148073 -0.012387 0.027153 0.384550 0.012725 0.056983 0.151818 -0.047608 -0.150341 0.403426 -0.093169 -0.056313 -0.228344 0.021027 0.016383 -0.201133 -0.082957 -0.018852
polarizability: 2.67917774e+02 1.32887211e+01 2.18391386e+02 7.09836324e+00 -6.38385300e+00 1.40489108e+02
1716.lowfreq: -7.2381 -0.0005 0.0001 0.0006 6.2689 8.0240 30.3466 35.3605 59.2790
frequency: 29.7558 35.2114 59.1996 64.4845 70.6711 80.2759 104.0140 131.8410 153.5866 166.9766 179.0419 188.4542 201.0012 215.6694 226.6385 256.1521 264.6109 289.5748 309.7002 320.0882 350.8172 362.9613 410.5517 428.7149 432.4693 436.7857 470.7458 478.4999 506.1774 523.7956 538.9913 577.2914 601.1093 631.7384 657.2685 661.5255 734.1687 747.3597 751.8396 782.5516 785.8832 794.0963 799.5664 817.7656 821.3433 874.9781 885.5038 910.5862 934.7522 965.6364 974.3755 986.3726 994.9890 1007.5708 1018.1189 1024.0166 1032.6824 1037.3423 1046.4264 1073.9000 1083.4512 1092.0131 1105.5721 1122.8856 1141.9250 1146.5175 1154.5364 1177.6143 1183.3244 1188.3374 1230.0187 1236.3334 1246.6894 1263.7432 1277.8656 1284.8608 1289.6459 1311.9798 1319.4305 1340.7902 1366.1985 1378.7730 1394.8043 1402.0161 1413.0705 1420.5261 1441.4230 1443.3992 1454.5106 1460.1864 1463.3492 1469.0701 1475.2321 1477.3231 1480.1575 1484.2704 1485.4422 1494.7978 1518.1815 1587.7120 1602.2210 1631.5800 1643.1916 2843.2038 2851.4734 2866.2416 2983.0663 3013.2694 3018.6048 3021.4118 3029.5213 3032.7329 3062.5456 3076.4696 3077.3325 3082.7379 3089.4391 3091.1800 3119.8100 3123.2992 3132.5907 3147.5119 3155.7479 3174.2268 3176.1550 3495.6437
redmass: 2.7484 4.3702 3.6848 4.0221 4.0276 6.9895 2.6933 2.6924 3.1059 2.7390 4.0551 4.0320 2.0411 1.7879 1.1348 1.4418 2.9231 3.1312 2.2203 2.9759 2.5824 3.5496 3.7641 3.8021 3.0552 2.6620 3.2742 3.4954 4.8091 5.3112 3.2511 3.6327 3.5776 1.4954 3.3702 3.8657 3.7897 1.2996 1.9738 3.0254 1.8326 3.0517 1.4369 1.7968 3.2535 1.7731 2.6275 1.7721 1.8921 1.4246 2.2207 1.3983 1.3761 2.9070 2.3233 2.3813 1.5834 2.5250 2.6336 2.4840 2.1553 1.4206 1.8514 2.1307 1.6017 2.0564 1.6613 1.3128 1.3022 1.6759 2.0686 1.7957 1.6282 2.3716 1.6942 1.9123 1.2732 1.3841 1.2208 1.3691 2.3168 1.3484 1.2064 2.7170 4.4738 1.1444 2.3525 1.1718 1.5117 1.2982 1.0983 1.0879 1.0625 1.0492 1.0718 1.0692 1.0534 1.0692 3.5656 7.3284 5.2214 6.3628 8.6963 1.0662 1.0594 1.0584 1.0360 1.0606 1.0722 1.0620 1.0806 1.0763 1.0993 1.1001 1.1004 1.1019 1.1012 1.1000 1.0866 1.0865 1.0899 1.0952 1.0967 1.0954 1.0934 1.0637
irintensity: 0.3978 0.1128 0.6798 0.5542 0.4454 0.9635 0.0686 0.2597 0.3756 1.0363 1.3815 0.2504 0.2317 0.2396 0.7906 1.4129 1.7670 1.5516 0.3897 0.8915 12.8361 1.6772 7.4111 1.3767 3.5901 1.2810 0.9413 7.6360 2.1362 7.1956 7.9312 7.7382 16.2896 122.4771 3.6345 18.5790 42.4582 3.5532 12.2052 2.6212 74.5660 2.5867 14.3283 47.0302 17.1145 7.6170 12.5139 1.7927 0.6783 6.6858 17.1251 1.4372 1.5063 26.5343 143.0697 45.0284 24.6425 15.8505 3.4487 8.6269 1.4772 6.3405 16.5385 44.9918 2.5862 7.2525 2.0908 1.4417 5.2449 7.8509 1.7706 2.4761 0.7407 8.6838 7.5142 5.1576 7.7268 10.1947 12.3951 0.6362 10.8883 11.0549 22.1817 4.4310 3.6676 2.9840 8.2318 1.4111 1.5471 2.9668 16.6059 5.5456 13.8379 7.2419 15.3616 19.3859 13.3248 1.0812 10.2090 3.5008 6.5737 1.5582 157.6763 68.9966 62.1072 212.2971 28.2194 8.1957 44.5895 6.9243 41.3126 24.8241 4.7338 15.1950 62.9342 28.0167 33.2553 60.0803 1.0393 2.9518 15.8300 30.0306 35.8217 15.6604 8.8960 24.2407
temp: 298.150 k
press: 1.00000 atm
elementType: 8 8 7 6 6 6 6 6 6 6 6 6 6 6 6 6 6 6 6 6 6 1 1 1 1 1 1 1 1 1 1 1 1 1 1 1 1 1 1 1 1 1 1 1
symmnumber: 1
zpe: 969378.3 jmol-1
zpe.correction: 0.369217 hartree
zpe.thermalcorrener: 0.390121 hartree
zpe.thermalcorrenthalpy: 0.391065 hartree
zpe.thermalcorrgfe: 0.319609 hartree
zpe.sumelectzpe: -903.337720 hartree
zpe.sumelectthermal: -903.316815 hartree
zpe.sumelectthermalent: -903.315871 hartree
zpe.sumelectthermalfe: -903.387327 hartree
dipole: 0.7069 -0.8564 1.1070
dipole: 1.5680
quadrupole: -110.9280 -113.9905 -134.8893
quadrupole: -2.8835 -0.9848 -0.7201
quadrupole: 9.0079 5.9454 -14.9534 -2.8835 -0.9848 -0.7201
hfenergy: -903.7069363 hartree
pointgroup: C01 [X(C18H23N1O2)]
dipole: -0.2808088 -0.385423 -0.3913655 debye
polarizability: 267.6914286|-12.7176672|218.9808575|8.7965863|-3.3567743|140.1259821 unknown
InChI: InChI=1S/C18H23NO2/c1-4-18(17(20)21,12-13-19(2)3)16-11-7-9-14-8-5-6-10-15(14)16/h5-11,20H,4,12-13H2,1-3H3
charge 0 multiplicity 1
44 atoms
O  -0.939692 -2.64216 0.612166
O  -0.654834 -0.953233 2.164561
N  -4.506263 0.566651 -0.014304
C  -0.688867 -0.328775 -0.242387
C  -2.005887 0.516525 -0.079093
C  -0.682086 -1.081183 -1.620644
C  0.580276 0.565603 -0.115747
C  -3.311353 -0.305585 -0.129397
C  -0.731266 -1.292066 0.964335
C  1.908544 -0.017211 0.002794
C  -0.806232 -0.151146 -2.84664
C  0.470804 1.961562 -0.167384
C  3.064745 0.863026 0.056497
C  2.159342 -1.432112 0.078728
C  1.609795 2.821476 -0.115267
C  2.887855 2.283084 -0.006831
C  -4.708244 1.105308 1.347933
C  -5.728411 -0.095282 -0.517011
C  4.382387 0.308354 0.177742
C  3.453324 -1.943479 0.199049
C  4.58207 -1.069675 0.247581
H  -1.939886 1.058204 0.881512
H  -2.067778 1.266494 -0.885602
H  0.254566 -1.657756 -1.709388
H  -1.496851 -1.826086 -1.627713
H  -3.306788 -1.097076 0.664119
H  -3.379173 -0.828269 -1.101222
H  -0.6920 -0.739137 -3.775512
H  -0.023801 0.628578 -2.843045
H  -1.789161 0.351806 -2.894195
H  -0.511404 2.431622 -0.248238
H  1.329138 -2.14157 0.047119
H  1.463792 3.906132 -0.159972
H  3.771149 2.931353 0.035045
H  -3.823885 1.676164 1.675775
H  -4.903007 0.305947 2.107919
H  -5.571299 1.794739 1.345465
H  -6.572597 0.617141 -0.489891
H  -6.023991 -0.998478 0.076294
H  -5.580218 -0.40835 -1.565873
H  5.235537 0.996429 0.217667
H  -1.001418 -3.173636 1.453152
H  3.604252 -3.027188 0.256942
H  5.592216 -1.482743 0.341356
