program: Gaussian 09
title: 000268235
version: EM64L-G09RevD.01
frameworkgroup: C1[X(C7H9NO3)]
method: RPBEPBE
basis: SDD
operation: Freq
keyword: #pfreq=noraman
keyword: PBEPBE/SDD
title: #p freq=noraman PBEPBE/SDD
converged: NO YES NO NO
title: Mulliken charges:
elementType: O O O N C C C C C C C H H H H H H H H H
charge: -0.278651 -0.447445 -0.447463 -0.307074 0.236990 0.236842 0.000490 -0.343597 -0.343564 -0.432090 -0.432058 0.291597 0.291601 0.240561 0.246704 0.240594 0.246669 0.321974 0.338961 0.338960
chargesum: 0.00000
title: Mulliken charges with hydrogens summed into heavy atoms:
elementType: O O O N C C C C C C C
charge: -0.278651 -0.108484 -0.108503 0.014900 0.236990 0.236842 0.000490 -0.052000 -0.051964 0.055175 0.055205
polarizability: 1.09710069e+02 1.08316191e-03 1.08482977e+02 1.01185770e+00 7.11524831e-04 5.32294843e+01
1716.lowfreq: -12.0985 -4.8280 0.0005 0.0006 0.0010 2.1014 50.0170 81.7903 114.5481
frequency: 50.0096 81.7892 114.5441 152.3584 214.1540 225.3376 262.7449 314.4838 327.1550 334.7862 343.1085 464.0488 516.9309 519.5387 545.2893 618.2470 624.7724 723.5709 762.5126 851.9919 879.9315 879.9842 901.2183 949.9570 956.9903 978.0581 1015.8724 1071.0329 1153.2303 1154.6895 1202.5696 1223.2802 1262.3867 1299.5084 1303.5571 1330.0885 1337.0250 1371.6285 1397.3259 1458.9297 1459.9840 1507.9477 1513.4486 1602.6735 1658.7687 2992.0887 2992.7860 3062.3507 3062.4551 3167.7699 3171.1134 3557.4767 3557.6438 3572.1442
redmass: 5.7066 2.6222 3.1489 6.1298 5.9890 2.3858 3.0432 5.8429 1.3131 4.6285 1.2303 3.3728 7.1303 3.9599 6.2789 1.1402 5.2668 5.5333 5.0732 5.0355 4.9268 1.3497 1.3655 2.0922 1.6147 2.9850 4.2365 2.2719 1.1263 1.1379 1.7598 3.3410 1.7439 1.4112 1.6332 1.3245 1.2804 1.5394 2.0675 1.0985 1.0790 2.8374 9.6638 3.9990 6.4477 1.0635 1.0635 1.0988 1.0990 1.0928 1.0950 1.0662 1.0662 1.0788
irintensity: 6.5500 0.6541 13.2196 0.3248 13.4093 17.0337 23.6149 0.2620 193.3548 28.4064 110.6784 11.9568 10.8333 3.5680 1.9455 122.9300 13.5890 15.8772 5.1036 2.5840 56.0448 4.8874 32.1646 14.7770 69.4022 0.0878 60.6720 29.2267 15.9064 7.0349 10.8295 32.5935 3.1275 4.5920 0.2621 4.8351 53.5161 10.2735 0.6293 1.2362 14.8730 80.0238 190.9305 0.3399 113.6361 0.8635 31.9743 23.0859 0.1010 0.2182 2.1910 15.2658 0.8044 74.0080
temp: 298.150 k
press: 1.00000 atm
elementType: 8 8 8 7 6 6 6 6 6 6 6 1 1 1 1 1 1 1 1 1
symmnumber: 1
zpe: 407049.1 jmol-1
zpe.correction: 0.155037 hartree
zpe.thermalcorrener: 0.165840 hartree
zpe.thermalcorrenthalpy: 0.166784 hartree
zpe.thermalcorrgfe: 0.118358 hartree
zpe.sumelectzpe: -551.715268 hartree
zpe.sumelectthermal: -551.704465 hartree
zpe.sumelectthermalent: -551.703521 hartree
zpe.sumelectthermalfe: -551.751947 hartree
dipole: 0.0015 5.6284 -0.0015
dipole: 5.6284
quadrupole: -74.8535 -59.8624 -60.9531
quadrupole: 0.0022 -10.4497 0.0016
quadrupole: -9.6305 5.3606 4.2699 0.0022 -10.4497 0.0016
hfenergy: -551.870305 hartree
pointgroup: C01 [X(C7H9N1O3)]
dipole: -0.0004703 2.2143731 0.0004329 debye
dipolederiv: -0.4979394 0.0000271 -0.0103374 -0.000069 -1.1971144 0.0003298 -0.0053398 -0.0004008 -0.3759574 -0.9091915 -0.0387616 0.1587041 0.0277444 -0.4896707 -0.008669 0.1996138 -0.0024737 -0.1587842 -0.9088946 0.0388642 0.159076 -0.0275201 -0.4896595 0.0089031 0.2001788 0.0026214 -0.15906 -0.6453105 0.0000232 -0.0298162 0.0000008 -0.7270969 0.0000642 -0.0238342 -0.0001171 -0.2429557 -0.1028155 0.416533 0.0540378 0.0798336 -0.4553574 0.0111176 0.0598911 0.0551697 -0.0984692 -0.1027685 -0.4165382 0.0541454 -0.0797852 -0.4553887 -0.0109945 0.0602113 -0.054867 -0.0985286 0.3110054 0.0000132 0.026442 0.0001158 1.3069605 -0.0002618 0.0652751 0.0000518 0.1315756 0.2719155 0.3114254 0.0442422 0.1840524 0.4914915 0.0049186 0.013268 -0.0156096 -0.1042004 0.2718987 -0.311404 0.0442306 -0.184019 0.4915586 -0.0052557 0.0132385 0.0156026 -0.1042219 0.6502797 -0.0449866 -0.118846 -0.1339888 0.2792417 0.0237255 -0.207913 0.0184413 0.2812382 0.6498885 0.0448605 -0.1190767 0.1336162 0.2791755 -0.0238972 -0.2082678 -0.0185108 0.2814754 0.0588914 0.0704535 -0.0142863 0.0815722 0.0551959 0.0065945 -0.0178566 0.0072224 0.179881 0.0588676 -0.0704546 -0.0142332 -0.0815688 0.0552066 -0.0065447 -0.0178661 -0.0070741 0.1798997 0.0224462 0.0559321 0.0117513 -0.0016938 -0.0480878 0.0770775 0.0264897 0.0951459 0.0274665 -0.0208121 -0.0253008 -0.0257777 0.0159525 0.0750064 -0.0505546 -0.0187154 -0.0750263 -0.0614501 0.0225985 -0.0560326 0.011788 0.0017015 -0.0481503 -0.076961 0.026508 -0.0950448 0.0276273 -0.0208477 0.0253861 -0.0258387 -0.0159236 0.0750893 0.0504831 -0.0187429 0.0749527 -0.0615771 0.1432633 0.0000012 -0.0122148 -0.000001 0.2346737 0.0000315 -0.0071442 0.0000412 0.3388314 0.3738249 0.0291529 -0.0968855 0.0892079 0.2834381 -0.0502034 -0.0693774 -0.0371493 0.0085732 0.3736999 -0.029194 -0.0971051 -0.0892282 0.2834881 0.0500964 -0.0696168 0.0370244 0.0086363 unknown
polarizability: 109.677672|-0.0010266|108.4829769|1.688973|-0.0043773|53.261882 unknown
InChI: InChI=1S/C7H9NO3/c9-3-5-1-8-2-6(4-10)7(5)11/h1-2,8-10H,3-4H2
charge 0 multiplicity 1
20 atoms
O  -0.000088 -2.144217 0.000218
O  -3.729178 0.020769 0.056153
O  3.728934 0.020381 -0.056724
N  -0.000011 1.995377 0.000247
C  -1.242229 -0.067861 -0.109979
C  1.242076 -0.067913 0.111068
C  -0.000141 -0.85574 0.001139
C  -1.205358 1.312782 -0.103824
C  1.205298 1.312736 0.104375
C  -2.55407 -0.818883 -0.2306
C  2.55393 -0.818956 0.231426
H  -2.11707 1.909126 -0.195479
H  2.117087 1.909041 0.195528
H  -2.513994 -1.721869 0.410448
H  -2.705637 -1.167773 -1.266837
H  2.513383 -1.722427 -0.408906
H  2.706156 -1.167054 1.267832
H  0.000028 3.015345 0.000011
H  -3.762852 0.196225 1.030801
H  3.761835 0.195307 -1.031496
