program: Gaussian 09
title: 000268230
version: EM64L-G09RevD.01
frameworkgroup: C1[X(C12H12N2O)]
method: RPBEPBE
basis: SDD
operation: Freq
keyword: #p
keyword: freq=noraman
keyword: PBEPBE/SDD
title: #p freq=noraman PBEPBE/SDD
converged: YES YES NO NO
title: Mulliken charges:
elementType: O N N C C C C C C C C C C C C H H H H H H H H H H H H
charge: -0.225442 -0.157170 -0.008538 -0.400362 -0.501411 0.340662 0.140267 -0.443070 0.088493 -0.360602 -0.434664 -0.358498 -0.233366 -0.261250 -0.148747 0.226474 0.224460 0.244271 0.244394 0.253563 0.247973 0.232555 0.280052 0.265609 0.277689 0.230047 0.236610
chargesum: 0.00000
title: Mulliken charges with hydrogens summed into heavy atoms:
elementType: O N N C C C C C C C C C C C C
charge: -0.225442 -0.157170 -0.008538 0.050573 -0.012747 0.340662 0.140267 0.058466 0.088493 -0.128047 0.110997 -0.080809 -0.003318 -0.024641 -0.148747
polarizability: 1.94282968e+02 6.48681026e-03 1.61002628e+02 -1.40446440e+01 8.66000599e-01 7.85518684e+01
1716.lowfreq: -6.2890 -0.0006 -0.0005 0.0005 2.9555 10.2535 40.2264 41.6994 94.5191
frequency: 40.1607 41.6560 94.4886 108.6246 142.9588 158.1511 194.4668 231.7460 288.7111 336.4694 353.0124 382.7968 399.6823 445.5967 458.0448 490.5351 526.7571 541.3792 552.4591 584.4647 667.9030 685.5621 749.6111 765.5559 771.2216 780.0492 852.2147 861.4741 928.3811 945.6580 968.6277 982.2814 994.3333 1021.7353 1030.0785 1050.0063 1064.3242 1079.2282 1117.9524 1153.2976 1180.7890 1187.8578 1216.0163 1233.5426 1264.7392 1281.3937 1290.8220 1298.7809 1325.4929 1346.2726 1354.5088 1382.4352 1398.3349 1432.2786 1451.1587 1455.8883 1465.7281 1489.9303 1502.6574 1566.3837 1583.9798 1623.7082 2196.4195 2919.9137 2988.2673 3003.0059 3020.9425 3048.8873 3055.7892 3084.3992 3084.5524 3131.1962 3145.5374 3158.0157 3171.5694
redmass: 6.7313 7.0109 4.0128 2.9324 3.7336 6.5369 2.8892 4.0217 4.5003 4.5217 2.8452 3.6678 3.0643 4.4263 6.1883 4.4945 3.2736 4.1739 4.3131 3.5942 3.6505 4.5776 3.7864 1.3368 1.3908 3.1714 1.9934 1.5240 2.5573 4.8836 1.3694 4.4461 1.3418 2.5908 2.6655 2.1716 2.3385 2.4390 1.9329 1.4997 1.0982 1.3037 1.6337 1.4317 2.2661 1.3172 1.6932 1.4056 1.3755 1.7102 1.2297 4.1944 2.0328 1.0967 1.2949 1.8679 1.3883 1.2516 1.5760 6.7456 9.3086 6.8620 12.4182 1.0703 1.0647 1.0589 1.0602 1.0924 1.1012 1.0971 1.1043 1.0860 1.0890 1.0933 1.1002
irintensity: 5.6733 7.6853 2.5663 1.3874 1.6039 7.8000 0.5793 3.7296 2.6247 8.9517 2.4853 0.7412 3.2048 6.7230 6.4360 12.8304 5.3564 0.5354 7.8252 10.0914 3.6111 3.6110 7.8069 81.9319 9.3622 2.6196 14.7318 3.5400 7.4516 2.2415 1.7081 10.3251 0.9394 14.5486 14.2743 2.8397 1.7396 9.5268 17.5990 0.7990 7.3459 42.2363 77.3366 8.3155 24.5168 9.3200 70.8676 35.5451 15.3302 97.8592 41.8656 25.0655 1.6926 24.8606 23.5730 32.6195 48.8570 27.6851 133.2624 25.9131 249.9491 165.2729 27.9812 64.7315 12.8732 1.8681 29.4417 29.6153 0.3302 6.2728 23.8479 5.1288 2.4508 24.2967 20.7169
temp: 298.150 k
press: 1.00000 atm
elementType: 8 7 7 6 6 6 6 6 6 6 6 6 6 6 6 1 1 1 1 1 1 1 1 1 1 1 1
symmnumber: 1
zpe: 563338.5 jmol-1
zpe.correction: 0.214564 hartree
zpe.thermalcorrener: 0.227591 hartree
zpe.thermalcorrenthalpy: 0.228535 hartree
zpe.thermalcorrgfe: 0.174108 hartree
zpe.sumelectzpe: -648.116428 hartree
zpe.sumelectthermal: -648.103402 hartree
zpe.sumelectthermalent: -648.102457 hartree
zpe.sumelectthermalfe: -648.156884 hartree
dipole: -0.5318 -0.2883 0.3085
dipole: 0.6790
quadrupole: -129.9890 -77.6433 -88.1423
quadrupole: 11.2279 2.2126 -1.1006
quadrupole: -31.3975 20.9482 10.4493 11.2279 2.2126 -1.1006
hfenergy: -648.3309926 hartree
pointgroup: C01 [X(C12H12N2O1)]
dipole: 0.210071 0.1112202 0.1219522 debye
polarizability: 194.0751562|-0.3731847|160.9877554|14.83525|-1.7344142|78.7745531 unknown
InChI: InChI=1S/C12H12N2O/c13-7-3-8-14-9-6-12(15)10-4-1-2-5-11(10)14/h1-2,4-5H,3,6,8-9H2
charge 0 multiplicity 1
27 atoms
O  -3.469301 1.60267 -0.46687
N  0.531596 0.739368 0.411834
N  5.317472 -0.309836 -0.118667
C  0.139242 2.071527 -0.10595
C  -1.299459 2.417456 0.306914
C  -0.368679 -0.324123 0.242769
C  -1.746322 -0.059384 -0.09339
C  1.956289 0.505982 0.655596
C  -2.27521 1.327472 -0.14184
C  0.034823 -1.687026 0.394224
C  2.747514 0.141223 -0.650916
C  -2.645119 -1.139956 -0.298258
C  -0.883265 -2.734259 0.1989
C  -2.230948 -2.473852 -0.161364
C  4.169242 -0.111269 -0.377343
H  0.217607 2.095832 -1.216914
H  0.843596 2.820712 0.297096
H  -1.615155 3.384586 -0.119346
H  -1.361847 2.496813 1.411387
H  2.089537 -0.296196 1.401488
H  2.393442 1.421532 1.091285
H  1.065542 -1.939451 0.660216
H  2.300665 -0.755815 -1.118335
H  2.663166 0.967115 -1.3819
H  -3.680117 -0.882829 -0.549234
H  -0.540831 -3.768302 0.321275
H  -2.933079 -3.298091 -0.318657
