program: Gaussian 09
title: 000268278
version: EM64L-G09RevD.01
frameworkgroup: C1[X(C18H27NO2)]
method: RPBEPBE
basis: SDD
operation: Freq
keyword: #p
keyword: freq=noraman
keyword: PBEPBE/SDD
title: #p freq=noraman PBEPBE/SDD
converged: YES YES NO NO
title: Mulliken charges:
elementType: O O N C C C C C C C C C C C C C C C C C C H H H H H H H H H H H H H H H H H H H H H H H H H H H
charge: -0.239695 -0.258979 -0.448357 -0.359536 -0.422987 -0.377978 -0.540598 0.209471 -0.360283 -0.341512 -0.375239 0.144775 -0.357512 -0.697600 -0.695200 0.485400 -0.451128 -0.355717 -0.197583 -0.216431 -0.256047 0.259934 0.217404 0.228317 0.233523 0.198497 0.249714 0.241319 0.205817 0.222076 0.186620 0.184925 0.239989 0.202835 0.199082 0.197236 0.221321 0.202496 0.212880 0.355880 0.209378 0.210478 0.218648 0.232805 0.304431 0.225097 0.224839 0.227194
chargesum: 0.00000
title: Mulliken charges with hydrogens summed into heavy atoms:
elementType: O O N C C C C C C C C C C C C C C C C C C
charge: -0.239695 -0.258979 -0.092477 -0.099602 0.022734 0.054043 -0.049565 0.209471 0.067609 0.030034 0.067585 0.144775 0.038805 -0.060904 -0.056696 0.485400 -0.218323 -0.051285 0.027514 0.008408 -0.028853
polarizability: 2.73603617e+02 -2.67380134e+01 2.11600996e+02 -6.16198857e+00 -2.44687378e+01 1.56596626e+02
1716.lowfreq: -13.9673 -8.5203 0.0001 0.0004 0.0006 3.9000 12.2206 25.6751 32.3632
frequency: 5.1483 25.3616 32.1774 38.5174 42.6398 48.3432 59.6963 77.7856 100.2514 104.6234 112.0463 122.0779 141.6562 150.2743 171.0516 195.7803 206.3400 230.0613 241.1781 256.4578 274.9264 302.2142 333.7381 355.4358 373.1180 402.5601 409.5169 431.6735 481.8831 512.7469 522.5798 543.5791 613.8928 644.1116 687.5016 697.8838 719.6044 723.8790 732.1894 752.7752 768.2559 801.2316 818.9589 828.0703 838.3127 846.1818 866.9993 890.4537 900.6355 920.5961 923.1202 940.3619 956.4447 967.1442 975.4336 984.9702 998.4098 999.1169 1008.1672 1026.6687 1054.9494 1074.5075 1078.6881 1084.0780 1088.4041 1095.1929 1106.8145 1126.3343 1127.8168 1168.3552 1171.7571 1187.2190 1196.0084 1210.9678 1228.5119 1240.2301 1253.3621 1267.1059 1271.3719 1283.1801 1292.4698 1294.8290 1299.7945 1314.7822 1324.4943 1327.5477 1348.2700 1350.7322 1354.8297 1358.7569 1385.4666 1388.6134 1390.2792 1421.1207 1436.5443 1458.2879 1462.9511 1464.6936 1468.1187 1477.3645 1477.3972 1478.0826 1486.2795 1486.5699 1487.2597 1491.9279 1542.8743 1589.7892 1600.1526 1616.2349 1630.3162 2946.8922 2952.0034 2968.9904 2969.4158 2970.9705 2972.7243 2983.0990 2987.2041 2989.8953 2991.7617 2994.4101 3023.7091 3028.7612 3033.4520 3044.5209 3055.0137 3055.5744 3063.9969 3069.3611 3071.3898 3073.1147 3118.3438 3130.8224 3143.9716 3163.8862 3193.4960 3309.0328
redmass: 3.5794 2.6318 2.7135 3.4354 3.6407 3.4498 3.1615 3.5229 5.4594 4.1417 1.7814 2.7896 3.5592 1.9767 4.0541 3.5703 2.4626 1.1151 2.8053 4.4285 1.7175 3.5903 5.8474 2.8362 3.0656 3.7887 2.9325 3.5534 2.5054 3.7711 3.8044 2.3491 6.4330 4.8576 3.0705 1.9133 1.1392 3.5327 1.5365 1.2774 1.7111 2.0499 1.6433 1.6994 1.9979 1.5166 1.3846 2.0606 2.2116 2.0043 1.8146 1.7946 2.0998 1.6904 1.3506 5.9480 2.0274 1.3629 3.0456 2.1351 2.9607 1.9966 2.0064 1.5250 1.5671 1.8525 1.7734 2.2576 2.5592 1.7561 1.0704 1.1169 1.5842 2.0396 1.3547 1.3606 1.2467 1.2230 2.3043 1.0990 1.1041 1.3161 1.1651 1.5210 1.4209 1.3779 1.4578 1.6028 1.3657 1.7387 7.1418 1.2160 1.2290 1.0988 2.3556 1.0829 1.0704 1.0801 1.0731 1.0447 1.0441 1.0682 2.3455 1.0757 1.0858 1.0704 2.3015 6.1819 7.4458 5.8103 2.9851 1.0610 1.0589 1.0371 1.0584 1.0616 1.0368 1.0611 1.0896 1.0629 1.0727 1.0913 1.1028 1.0970 1.0975 1.0948 1.0936 1.1027 1.1001 1.1009 1.0989 1.0992 1.0874 1.0874 1.0938 1.1000 1.0951 1.0801
irintensity: 0.1487 0.5029 0.3663 0.0378 0.1912 0.4049 1.1524 0.9977 2.2797 1.7080 0.6767 1.6583 3.7158 1.1382 3.3185 1.0339 0.2042 0.0635 8.2722 8.3571 3.1656 4.1114 1.9105 2.1985 0.7514 6.1389 0.1319 9.4524 3.3119 14.3987 14.0779 1.8989 0.3152 0.4601 3.1768 38.4560 16.2404 14.2148 10.1387 5.6069 51.4278 7.8272 16.4485 24.4528 0.5842 2.4906 36.3855 3.7603 14.2923 6.2168 22.9184 18.5003 5.1572 7.2375 0.0568 1.2035 6.1328 2.4684 20.9997 5.5395 23.1283 2.9615 8.7374 9.9645 17.0411 11.2288 7.1692 7.2393 40.5655 34.3879 1.0521 0.9141 0.8615 36.8200 2.4431 28.8628 1.6535 22.5036 34.9733 0.5981 0.9151 0.5151 3.4749 63.6755 21.7007 8.6152 7.7264 14.7400 0.5656 31.5313 27.3783 10.4439 15.5012 33.0607 56.0368 5.2111 1.1827 9.0991 0.7853 3.9744 15.0541 7.1154 66.4112 19.8048 16.4172 9.6649 539.7607 40.7940 152.5531 29.9058 120.7153 17.0459 19.0564 27.0199 52.9560 20.0168 34.4375 40.6664 13.4224 15.4865 17.8791 8.7984 15.5361 5.6919 3.7231 17.9748 51.2526 40.4886 104.5495 99.2284 43.4232 51.4516 9.1188 1.7149 31.7828 29.3621 6.1068 256.2632
temp: 298.150 k
press: 1.00000 atm
elementType: 8 8 7 6 6 6 6 6 6 6 6 6 6 6 6 6 6 6 6 6 6 1 1 1 1 1 1 1 1 1 1 1 1 1 1 1 1 1 1 1 1 1 1 1 1 1 1 1
symmnumber: 1
zpe: 1084201.3 jmol-1
zpe.correction: 0.412950 hartree
zpe.thermalcorrener: 0.436288 hartree
zpe.thermalcorrenthalpy: 0.437232 hartree
zpe.thermalcorrgfe: 0.355352 hartree
zpe.sumelectzpe: -905.720552 hartree
zpe.sumelectthermal: -905.697215 hartree
zpe.sumelectthermalent: -905.696270 hartree
zpe.sumelectthermalfe: -905.778151 hartree
dipole: -3.0034 0.3914 1.2970
dipole: 3.2948
quadrupole: -121.3140 -126.4258 -131.4441
quadrupole: -5.5980 3.9034 2.1576
quadrupole: 5.0807 -0.0312 -5.0495 -5.5980 3.9034 2.1576
hfenergy: -906.1335025 hartree
pointgroup: C01 [X(C18H27N1O2)]
dipole: 1.2131069 0.1498839 -0.4315586 debye
polarizability: 274.214436|24.7006547|210.890966|1.8011627|26.5590889|156.6958375 unknown
InChI: InChI=1S/C18H27NO2/c1-3-5-8-14-17(20)16(13-6-4-2)18(21)19-15-11-9-7-10-12-15/h7,9-12,16,19H,3-6,8,13-14H2,1-2H3
charge 0 multiplicity 1
48 atoms
O  0.925234 -1.146892 -0.651083
O  -1.761635 1.322023 1.569398
N  -1.66192 -0.407033 -0.031102
C  0.333002 1.002717 0.352978
C  0.371494 1.925576 -0.922842
C  -0.42939 3.243194 -0.77912
C  2.652685 -0.109558 0.728436
C  1.272692 -0.177731 0.091546
C  3.647386 -1.177559 0.239265
C  5.007581 -1.094313 0.966275
C  0.015598 4.165534 0.382939
C  -1.131402 0.638941 0.703445
C  6.021884 -2.148695 0.466967
C  1.500359 4.589436 0.324219
C  7.378022 -2.073872 1.200417
C  -2.981292 -0.938978 0.006717
C  -3.249554 -2.06298 -0.822244
C  -4.017019 -0.399125 0.816825
C  -4.535142 -2.639185 -0.844456
C  -5.299657 -0.988494 0.781873
C  -5.571006 -2.104834 -0.042001
H  0.708993 1.584363 1.212182
H  1.430996 2.161425 -1.146923
H  -0.014247 1.346287 -1.783648
H  -1.504157 3.009843 -0.656386
H  -0.329155 3.79351 -1.737444
H  2.50354 -0.190687 1.828226
H  3.056382 0.914389 0.576105
H  3.79677 -1.064627 -0.852499
H  3.202281 -2.180595 0.380998
H  4.854594 -1.226184 2.058237
H  5.442189 -0.080934 0.833595
H  -0.204771 3.670642 1.347801
H  -0.618181 5.073899 0.35904
H  5.586014 -3.160509 0.59394
H  6.179977 -2.013683 -0.622409
H  1.737032 5.310263 1.128068
H  2.183398 3.726804 0.445876
H  1.740218 5.071359 -0.642941
H  -0.969964 -0.902709 -0.620999
H  7.848775 -1.081507 1.066168
H  7.251615 -2.240073 2.286993
H  8.084315 -2.835795 0.822962
H  -2.448757 -2.482169 -1.444387
H  -3.80342 0.458051 1.457761
H  -4.727242 -3.505385 -1.487365
H  -6.093758 -0.56793 1.409348
H  -6.570453 -2.55252 -0.058851
