program: Gaussian 09
title: 000268227
version: EM64L-G09RevD.01
frameworkgroup: C1[X(C9H8O4)]
method: RPBEPBE
basis: SDD
operation: Freq
keyword: #p
keyword: freq=noraman
keyword: PBEPBE/SDD
title: #p freq=noraman PBEPBE/SDD
converged: YES YES NO NO
title: Mulliken charges:
elementType: O O O O C C C C C C C C C H H H H H H H H
charge: -0.404343 -0.439721 -0.235195 -0.251586 0.463100 -0.615048 -0.536093 0.257056 -0.345651 -0.337535 -0.207284 0.212958 0.111055 0.252960 0.252034 0.276873 0.269599 0.277744 0.235015 0.379297 0.384765
chargesum: 0.00000
title: Mulliken charges with hydrogens summed into heavy atoms:
elementType: O O O O C C C C C C C C C
charge: -0.025047 -0.054956 -0.235195 -0.251586 0.463100 -0.110054 -0.259220 0.257056 -0.076052 -0.059791 0.027731 0.212958 0.111055
polarizability: 1.47317892e+02 6.22602352e+00 1.19028566e+02 6.42184630e+00 -5.62145040e+00 5.87319834e+01
1716.lowfreq: -10.1261 -6.5647 -0.0006 -0.0005 0.0002 2.9096 20.3420 23.1942 59.2455
frequency: 20.3334 23.1434 59.2421 107.4082 155.1112 162.8967 228.7306 293.9498 368.5114 383.9157 419.4406 465.5959 490.3784 504.4824 553.1720 595.1893 599.8665 640.0328 686.5680 692.7346 725.4193 749.1002 818.7358 856.3465 878.4863 925.6739 954.8044 956.7343 990.1510 1003.3767 1040.4717 1059.9255 1097.4750 1137.0684 1179.9266 1186.0091 1214.3424 1266.9743 1301.1363 1324.4261 1337.0975 1394.0231 1443.6484 1452.9137 1475.4462 1590.7502 1616.1004 1643.4396 1661.1310 3011.0388 3106.0247 3139.2132 3146.7419 3158.1273 3180.8220 3506.5685 3531.8777
redmass: 5.6306 9.5738 9.5916 6.1627 4.7904 5.9833 4.4557 5.0206 5.8178 3.4446 3.0548 3.0156 4.1087 3.9955 4.0899 4.4863 1.3193 1.6397 2.8003 3.4614 2.4605 5.9418 1.8934 3.3835 3.6077 1.8626 1.7717 1.4636 5.9128 1.3775 2.7734 2.0609 1.7251 1.5130 1.1976 1.1560 2.0605 1.5027 1.5353 2.3882 1.9503 7.6902 3.0051 1.1436 2.2725 6.1255 6.3204 8.6191 8.5394 1.0641 1.0976 1.0877 1.0923 1.0946 1.0968 1.0639 1.0642
irintensity: 1.5344 2.7348 1.6526 1.7733 0.9830 0.3907 0.1388 1.4523 6.5932 6.0063 4.2647 3.1025 14.3718 26.4136 38.8957 47.7824 105.9730 173.4929 35.7770 0.9419 73.5792 7.9984 26.0343 8.3588 12.3992 34.4710 34.8768 8.3572 1.6172 0.5232 190.0286 286.1014 28.9126 99.8333 12.5944 1.8997 6.7060 1.7879 49.7360 88.7851 46.6601 6.4524 52.7465 20.4918 10.7810 26.3574 4.4250 269.8178 191.6490 8.2219 3.9194 5.2364 2.2149 6.7400 4.7282 24.8304 46.0467
temp: 298.150 k
press: 1.00000 atm
elementType: 8 8 8 8 6 6 6 6 6 6 6 6 6 1 1 1 1 1 1 1 1
symmnumber: 1
zpe: 403812.9 jmol-1
zpe.correction: 0.153804 hartree
zpe.thermalcorrener: 0.165552 hartree
zpe.thermalcorrenthalpy: 0.166496 hartree
zpe.thermalcorrgfe: 0.113257 hartree
zpe.sumelectzpe: -647.738737 hartree
zpe.sumelectthermal: -647.726990 hartree
zpe.sumelectthermalent: -647.726046 hartree
zpe.sumelectthermalfe: -647.779284 hartree
dipole: 0.2541 0.7382 0.0007
dipole: 0.7807
quadrupole: -66.0426 -77.5140 -72.5141
quadrupole: -9.4859 1.6223 1.5148
quadrupole: 5.9809 -5.4904 -0.4905 -9.4859 1.6223 1.5148
hfenergy: -647.8925414 hartree
pointgroup: C01 [X(C9H8O4)]
dipole: -0.0745268 0.292539 0.0565839 debye
dipolederiv: -0.5503773 -0.3503271 -0.0191896 -0.414159 -1.0187425 0.1921703 0.1219099 0.3035467 -0.3735507 -1.2812022 -0.1790046 -0.2526225 -0.2723661 -0.3498564 -0.0402878 -0.30713 -0.0164321 -0.5029655 -0.6640789 0.2020261 0.1587251 -0.0009037 -0.824851 -0.0125878 0.2658999 -0.1699445 -0.4685078 -0.6939371 0.1993279 -0.0053724 0.1728787 -1.0090135 -0.2183421 -0.0275059 -0.1972472 -0.4107358 0.4267433 0.1663025 0.0983416 0.2374152 -0.1160831 -0.0439814 0.2642595 0.0093921 -0.0646534 -0.3465088 -0.0723187 0.1427308 -0.0399329 0.0612665 0.0373164 0.134673 -0.0021764 -0.0299564 -0.0530781 -0.1780467 -0.0171432 0.0179383 0.0036862 0.0629078 0.0299235 -0.0027229 -0.0965795 -0.4539409 0.2755698 0.0006734 0.3559392 -0.237225 -0.0212285 0.002361 -0.025466 0.0118626 0.0012295 -0.0609364 0.0174944 -0.0904262 -0.0105054 0.0333875 -0.0315839 0.0457885 -0.1022914 0.0604527 0.0312463 0.0584995 -0.1983644 0.0067752 0.008234 -0.0279217 0.0530426 -0.1043007 -0.2365481 0.0248121 -0.0030983 0.0361921 0.1437035 0.1037749 -0.0168914 0.1106846 -0.1078505 0.9630943 0.1078725 -0.4392732 0.2712683 1.4759788 -0.1348629 -0.7699789 -0.1077322 0.5881856 1.8819043 -0.33548 0.2493183 -0.312156 1.2917574 0.3326429 0.2910329 0.3005612 0.4112379 0.0636346 0.0391701 0.0249598 -0.0156913 -0.0398803 -0.073379 0.0206777 -0.0344019 0.0802306 0.0143197 0.0109462 -0.0532088 0.0461414 0.0422479 0.0828054 -0.0493839 0.0357811 0.0151692 0.1289676 -0.021672 -0.0194342 -0.0424875 0.0147454 -0.0547229 -0.0172864 -0.0505794 0.1247085 0.0342157 0.0880191 -0.0147674 0.0806014 0.0816148 -0.0130091 -0.0013382 -0.0163283 0.1339342 0.0185248 -0.0462742 -0.0491896 -0.045164 0.1099603 -0.0283821 -0.0455151 -0.029458 0.1400901 0.0736673 -0.0102732 -0.0190122 -0.0097252 -0.080821 -0.0818533 -0.0232836 -0.086584 0.1200498 0.2732851 0.0516051 0.1377449 0.0939739 0.2953454 -0.0747339 0.1546852 -0.0474716 0.2545362 0.3396326 0.0574352 0.0038234 0.1290277 0.1598967 -0.0558683 0.0323963 -0.0722524 0.3813871 unknown
polarizability: 145.916896|-9.9119786|116.1399673|5.799224|16.2374051|63.0215787 unknown
InChI: InChI=1S/C9H8O4/c10-8(11)5-6-2-1-3-7(4-6)9(12)13/h1-4,10,12H,5H2
charge 0 multiplicity 1
21 atoms
O  -3.650374 -1.354142 0.38313
O  3.930398 -0.365726 0.362594
O  -3.714298 0.963217 0.514245
O  2.720796 -2.1172 -0.563792
C  -0.795472 0.369996 -0.524595
C  -2.139499 -0.13567 -1.052149
C  0.336832 -0.471135 -0.54769
C  1.591624 -0.003749 -0.077484
C  -0.663496 1.690156 -0.017128
C  1.717715 1.315843 0.424059
C  0.584617 2.155834 0.452548
C  -3.229362 -0.072982 0.009178
C  2.746702 -0.938519 -0.132551
H  -2.0487 -1.169639 -1.417092
H  -2.472676 0.502902 -1.892156
H  0.271791 -1.497676 -0.925589
H  -1.544066 2.34112 0.020297
H  2.690429 1.663508 0.782176
H  0.671583 3.175973 0.841052
H  -4.349125 -1.280772 1.089848
H  4.659481 -1.039238 0.2990
