program: Gaussian 09
title: 000268226
version: EM64L-G09RevD.01
frameworkgroup: C1[X(C15H26)]
method: RPBEPBE
basis: SDD
operation: Freq
keyword: #p
keyword: freq=noraman
keyword: PBEPBE/SDD
title: #p freq=noraman PBEPBE/SDD
converged: YES YES NO YES
title: Mulliken charges:
elementType: C C C C C C C C C C C C C C C H H H H H H H H H H H H H H H H H H H H H H H H H H
charge: -0.079456 -0.088927 -0.044334 -0.021742 -0.486080 -0.489885 -0.510150 -0.508943 -0.483238 -0.467559 -0.017086 -0.436610 -0.408110 -0.397911 -0.754500 0.198110 0.201728 0.217443 0.201134 0.196262 0.197674 0.194770 0.198525 0.207738 0.207978 0.190154 0.199510 0.196558 0.207823 0.192318 0.193109 0.190324 0.194543 0.190921 0.195352 0.190539 0.195531 0.190767 0.212656 0.220028 0.213036
chargesum: 0.00000
title: Mulliken charges with hydrogens summed into heavy atoms:
elementType: C C C C C C C C C C C C C C C
charge: 0.118654 0.112801 0.173108 0.179393 -0.092145 -0.096590 -0.094435 -0.119278 -0.078857 -0.082131 0.173238 -0.051145 -0.022219 -0.011613 -0.108780
polarizability: 1.78741014e+02 -1.39468453e-01 1.50020726e+02 1.76496513e-01 3.81210163e-01 1.25689161e+02
1716.lowfreq: -28.5759 -0.0006 -0.0004 0.0004 8.2978 24.9512 59.3362 71.3023 125.6047
frequency: 59.1646 71.2929 125.5858 149.0863 183.1590 197.8001 220.6033 229.7783 281.8688 298.8385 320.1727 349.3196 369.5221 371.4394 380.8950 406.6460 432.3655 440.9022 482.0482 504.0436 515.3488 567.2649 641.5578 757.2590 768.3961 795.3243 825.3291 829.9801 839.0763 852.1876 886.7165 892.9945 906.6854 934.6075 944.7360 950.6038 978.8022 989.8130 1001.5342 1009.7689 1026.6756 1053.2574 1057.4510 1062.2284 1080.0228 1088.6124 1091.6729 1102.8877 1114.5284 1131.6828 1146.0112 1155.3219 1162.7167 1172.0487 1189.0692 1205.7977 1219.4883 1240.6178 1247.3388 1253.3538 1273.3727 1276.6401 1283.2531 1292.6222 1301.0417 1306.8936 1313.4432 1322.0335 1323.4783 1331.4799 1333.4543 1334.9851 1338.8032 1339.9849 1345.4448 1347.9786 1350.9525 1356.4680 1360.5907 1386.7012 1450.9449 1454.8520 1458.4294 1460.3556 1461.7608 1463.5702 1465.9189 1470.9065 1472.5215 1479.3233 1487.0173 2902.0862 2910.3664 2925.7450 2936.0409 2943.7617 2949.0242 2952.8090 2953.9906 2955.7293 2956.4668 2961.4205 2963.3270 2964.5183 2970.1893 2977.3656 3003.5884 3007.6094 3013.5836 3017.4847 3021.2566 3021.8980 3026.9259 3032.6730 3038.0749 3063.0532 3070.9766
redmass: 3.0620 2.6649 2.6243 2.3238 3.0590 1.1492 1.9529 2.2824 2.0883 2.2778 2.1116 2.3940 3.0884 2.5299 1.9103 2.8087 3.2411 2.7396 2.6654 2.1241 2.1626 2.2572 2.0042 2.4355 1.9408 2.4081 1.7830 1.8012 1.7046 2.0412 1.5801 1.7439 2.2252 2.1095 1.7683 1.8926 1.6471 1.6301 1.9773 2.0098 1.6517 1.7465 1.4432 1.6027 1.9578 1.5805 1.9706 1.5228 2.2296 2.1703 1.5569 2.1392 2.7098 1.2535 1.5682 1.4696 1.5403 1.3083 1.3583 1.2768 1.3424 1.2542 1.2632 1.2403 1.2892 1.2852 1.4679 1.4914 1.4579 1.3699 1.5618 1.5118 1.5522 1.4709 1.4780 1.4389 1.5513 1.4333 1.5107 1.2203 1.0870 1.0885 1.0795 1.0868 1.0861 1.0844 1.0860 1.0918 1.0919 1.0564 1.0587 1.0779 1.0805 1.0822 1.0791 1.0641 1.0606 1.0642 1.0652 1.0636 1.0633 1.0597 1.0656 1.0626 1.0531 1.0600 1.1000 1.0992 1.0986 1.0980 1.0997 1.0988 1.1000 1.1005 1.0989 1.0992 1.0986
irintensity: 0.0038 0.0117 0.0697 0.0204 0.0068 0.0772 0.0354 0.1011 0.0962 0.1434 0.0529 0.1036 0.1221 0.1162 0.0606 0.1004 0.2182 0.4560 0.0527 0.1777 0.3271 1.2992 3.9266 1.0000 0.4530 0.9463 2.7680 4.3987 2.3285 3.0666 0.3852 6.9351 1.7297 4.4025 3.8324 5.9586 6.5820 2.7362 0.7351 0.4710 0.8168 2.9196 0.7098 2.2397 2.0639 3.9795 2.9226 0.2201 0.1310 0.0330 1.2712 2.3186 0.9225 0.5984 6.4735 0.2433 2.5309 0.4550 1.5187 0.9399 0.8278 1.1031 0.2965 1.3253 4.4183 0.3420 0.2369 1.4109 1.1375 2.3502 0.5137 0.7031 0.0676 0.2000 0.1499 0.1087 0.1601 5.0091 2.0507 22.0236 3.3440 2.9690 2.5645 6.5230 1.0220 16.6822 18.3161 3.0901 3.5014 18.8136 4.2063 0.6505 1.3567 13.7975 9.2771 13.1946 4.1314 12.3211 22.2687 56.9545 119.4340 47.0254 46.2567 37.8915 80.2783 57.6185 5.8785 23.3189 119.4483 12.3467 119.1571 49.5962 36.7106 162.2257 67.2744 41.6773 60.7068
temp: 298.150 k
press: 1.00000 atm
elementType: 6 6 6 6 6 6 6 6 6 6 6 6 6 6 6 1 1 1 1 1 1 1 1 1 1 1 1 1 1 1 1 1 1 1 1 1 1 1 1 1 1
symmnumber: 1
zpe: 991396.1 jmol-1
zpe.correction: 0.377603 hartree
zpe.thermalcorrener: 0.391735 hartree
zpe.thermalcorrenthalpy: 0.392679 hartree
zpe.thermalcorrgfe: 0.338009 hartree
zpe.sumelectzpe: -586.007300 hartree
zpe.sumelectthermal: -585.993168 hartree
zpe.sumelectthermalent: -585.992224 hartree
zpe.sumelectthermalfe: -586.046894 hartree
dipole: -0.0391 -0.0250 -0.0919
dipole: 0.1029
quadrupole: -96.2207 -96.0467 -94.5187
quadrupole: 0.0250 -0.0275 0.0149
quadrupole: -0.6253 -0.4513 1.0766 0.0250 -0.0275 0.0149
hfenergy: -586.3849027 hartree
pointgroup: C01 [X(C15H26)]
dipole: -0.0156467 0.0099128 0.0360092 debye
polarizability: 178.7407531|0.1386307|150.0222189|0.2099663|0.3318524|125.6879293 unknown
InChI: InChI=1S/C15H26/c1-11-6-9-15-13(10-11)8-7-12-4-2-3-5-14(12)15/h11-15H,2-10H2,1H3
charge 0 multiplicity 1
41 atoms
C  -0.451228 0.345749 0.388007
C  0.998063 0.386504 -0.190184
C  -1.193214 -0.948374 -0.059248
C  1.790774 -0.895586 0.205752
C  -0.394978 -2.213075 0.333625
C  1.040916 -2.175155 -0.229407
C  -1.29009 1.596399 0.013361
C  -2.631613 -0.998918 0.513396
C  1.784026 1.653144 0.241157
C  3.23224 -0.867359 -0.360064
C  -3.488066 0.242901 0.149845
C  -2.729605 1.527926 0.578501
C  3.228464 1.671303 -0.314027
C  4.004449 0.39497 0.081566
C  -3.890571 0.268586 -1.345296
H  -0.367286 0.31285 1.50057
H  0.915558 0.397084 -1.302855
H  -1.255963 -0.925496 -1.170474
H  1.863697 -0.903992 1.318196
H  -0.92675 -3.117334 -0.025485
H  -0.355053 -2.285697 1.441567
H  1.607978 -3.069884 0.098205
H  1.002254 -2.211463 -1.339152
H  -1.317979 1.694522 -1.092101
H  -0.803773 2.513203 0.396357
H  -3.137421 -1.921722 0.161656
H  -2.563151 -1.075916 1.619904
H  1.817303 1.692104 1.351481
H  1.255752 2.565352 -0.094043
H  3.182825 -0.897003 -1.469739
H  3.773076 -1.781728 -0.042003
H  -4.428375 0.191185 0.738638
H  -2.673668 1.553588 1.687022
H  -3.300713 2.425687 0.267227
H  3.760714 2.573971 0.045231
H  3.190021 1.741709 -1.421345
H  5.017243 0.404616 -0.366901
H  4.140637 0.375401 1.183014
H  -4.547234 1.132826 -1.559633
H  -3.013316 0.344311 -2.012917
H  -4.440647 -0.65109 -1.620404
