program: Gaussian 09
title: 000268241
version: EM64L-G09RevD.01
frameworkgroup: C1[X(C12H10ClN5O2S)]
method: RPBEPBE
basis: SDD
operation: Freq
keyword: #p
keyword: freq=noraman
keyword: PBEPBE/SDD
title: #p freq=noraman PBEPBE/SDD
converged: NO YES NO NO
title: Mulliken charges:
elementType: Cl S O O N N N N N C C C C C C C C C C C C H H H H H H H H H H
charge: 0.032424 0.951807 -0.534339 -0.537379 -0.144909 -0.029125 -0.026837 -0.718652 0.062716 -0.587528 0.521799 0.157732 -0.336450 -0.400747 -0.038774 0.140497 -0.197410 -0.239799 -0.231537 -0.302990 -0.358362 0.238076 0.270117 0.282471 0.243705 0.272245 0.286986 0.287972 0.258452 0.338871 0.338968
chargesum: 0.00000
title: Mulliken charges with hydrogens summed into heavy atoms:
elementType: Cl S O O N N N N N C C C C C C C C C C C C
charge: 0.032424 0.951807 -0.534339 -0.537379 -0.144909 -0.029125 -0.026837 -0.040813 0.062716 -0.079335 0.521799 0.157732 -0.053979 -0.157042 -0.038774 0.140497 0.074835 0.047187 0.056436 -0.302990 -0.099911
polarizability: 2.58004978e+02 -2.11268700e+01 1.83471332e+02 1.96499756e-01 -2.28872055e+01 1.67362793e+02
1716.lowfreq: -7.9282 -3.5009 -0.0023 0.0004 0.0008 3.3223 11.5018 21.0916 25.6717
frequency: 10.9953 21.0357 25.6602 43.1973 63.6081 99.8250 115.0713 121.1454 160.4970 172.2744 183.0551 220.9794 232.9097 257.2927 267.1216 281.6606 309.9918 327.9979 361.8113 380.5522 383.8099 408.3859 425.8770 470.4796 511.1532 533.9403 542.1513 563.9521 608.9722 620.4556 629.1799 648.2124 656.2718 701.2459 757.3052 788.4308 792.2341 797.8376 805.5926 813.6202 841.4724 857.9474 875.0963 896.2135 907.4932 918.0057 944.6165 977.0481 997.5799 998.8030 1055.6292 1070.8499 1086.5407 1108.5408 1125.7557 1158.0366 1183.5329 1188.9313 1210.4057 1247.8730 1285.0968 1299.6652 1304.1292 1332.6042 1358.6161 1370.4575 1388.4412 1399.3732 1408.1777 1442.0150 1466.7853 1477.1118 1507.7438 1534.4734 1562.6264 1598.3904 1599.2557 3025.6538 3086.2309 3133.3144 3139.6814 3163.4084 3165.9320 3187.3328 3230.5812 3367.5638 3535.0362
redmass: 6.2469 11.4180 8.1599 3.8960 7.8962 9.4577 8.1209 1.5208 7.1451 6.5222 8.9760 8.2884 6.1630 6.3424 2.3815 9.0218 3.3935 5.6455 7.2928 3.2671 13.5135 2.8728 10.1144 3.5444 4.4191 4.3188 5.3298 7.1699 5.6766 6.9323 5.9981 6.1280 5.5344 4.8562 4.1532 4.3688 2.1491 5.9070 7.4926 3.9540 1.5569 1.3334 1.6718 7.2622 4.0597 1.4339 1.9161 1.4060 2.3109 2.0992 2.5100 1.5154 3.8083 3.2991 1.6533 3.0409 2.0787 1.2269 2.7292 1.9265 8.1215 1.5770 2.8267 2.0865 1.7280 2.9376 6.0755 1.9254 2.6415 2.4732 1.5839 1.8713 8.0951 1.0852 9.9167 6.3285 6.8692 1.0598 1.1050 1.0899 1.0907 1.0951 1.0966 1.0930 1.0987 1.0414 1.1004
irintensity: 1.3442 0.7444 1.5343 1.5248 1.5803 0.9470 0.3386 36.9629 1.0933 0.0184 1.0010 0.7327 8.7334 6.6151 5.3521 4.4871 3.3050 6.7643 9.9005 0.4362 10.2629 0.1427 51.0286 105.4278 72.1323 5.0160 8.3148 25.7192 15.3396 0.2805 5.6103 14.5184 18.8810 21.2269 58.7932 17.0005 98.5299 35.0385 9.5587 127.6832 11.3801 2.5887 23.1420 76.7617 62.5403 12.1696 16.4829 0.9873 2.0217 2.1865 29.7639 35.1405 20.5525 14.5356 3.8183 92.7435 13.1244 8.2853 8.0611 44.7712 59.0743 2.7718 75.3917 47.8601 12.3325 3.9057 9.3121 60.3301 18.0031 60.2588 46.8206 44.6690 127.1628 24.4741 89.8984 1.7040 0.8675 20.0727 3.3497 8.7145 0.9649 0.5674 5.8548 7.5529 0.1561 30.4360 27.2107
temp: 298.150 k
press: 1.00000 atm
elementType: 17 16 8 8 7 7 7 7 7 6 6 6 6 6 6 6 6 6 6 6 6 1 1 1 1 1 1 1 1 1 1
symmnumber: 1
zpe: 557076.1 jmol-1
zpe.correction: 0.212179 hartree
zpe.thermalcorrener: 0.231325 hartree
zpe.thermalcorrenthalpy: 0.232269 hartree
zpe.thermalcorrgfe: 0.160792 hartree
zpe.sumelectzpe: -1743.924002 hartree
zpe.sumelectthermal: -1743.904856 hartree
zpe.sumelectthermalent: -1743.903912 hartree
zpe.sumelectthermalfe: -1743.975389 hartree
dipole: -0.7189 3.1589 -0.4306
dipole: 3.2681
quadrupole: -186.8152 -123.1067 -136.1126
quadrupole: 8.9406 22.6664 4.2126
quadrupole: -38.1370 25.5715 12.5656 8.9406 22.6664 4.2126
hfenergy: -1744.1361814 hartree
pointgroup: C01[X(C12H10Cl1N5O2S1)]
dipole: -0.2795031 1.2473167 0.1389871 debye
polarizability: 257.8587663|-20.7708608|193.3828874|-5.5733889|-16.2633725|157.5974498 unknown
InChI: InChI=1S/C12H10ClN5O2S/c13-11-10-12(16-6-15-11)18(7-17-10)5-8-1-3-9(4-2-8)21(14,19)20/h1-4,6-7H,5,14H2
charge 0 multiplicity 1
31 atoms
Cl 5.609763 -0.969282 -1.825362
S  -4.875215 -0.775236 -0.505483
O  -5.092589 -2.160577 0.322516
O  -5.955918 0.44349 -0.531287
N  1.672182 1.248379 0.436969
N  3.174609 1.305992 -1.309887
N  2.438826 -0.819979 1.560461
N  -4.580467 -1.246713 -2.257181
N  4.351274 -1.831207 0.419976
C  0.539077 1.615507 1.317843
C  -0.79289 1.030395 0.857286
C  2.490601 0.13013 0.591588
C  -1.039731 -0.35963 1.005241
C  -1.792127 1.867159 0.303028
C  -3.220064 -0.051048 0.026825
C  3.424131 0.183961 -0.502707
C  2.126444 1.905896 -0.718457
C  -2.265871 -0.916458 0.585828
C  -3.027472 1.329826 -0.122528
C  4.360535 -0.873868 -0.52341
C  3.405796 -1.770609 1.415322
H  0.49053 2.717055 1.362406
H  0.795876 1.240456 2.324079
H  -0.271542 -0.999239 1.454762
H  -1.61429 2.944719 0.206762
H  1.657009 2.819592 -1.078771
H  -2.489003 -1.98036 0.713749
H  -3.824018 1.960516 -0.52968
H  3.433062 -2.572103 2.15716
H  -4.693209 -2.270755 -2.340874
H  -5.237011 -0.711709 -2.849775
