program: Gaussian 09
title: 000268203
version: EM64L-G09RevD.01
frameworkgroup: C1[X(C11H12N2O4)]
method: RPBEPBE
basis: SDD
operation: Freq
keyword: #p
keyword: freq=noraman
keyword: PBEPBE/SDD
title: #p freq=noraman PBEPBE/SDD
converged: YES YES NO NO
title: Mulliken charges:
elementType: O O O O N N C C C C C C C C C C C H H H H H H H H H H H H
charge: -0.210661 -0.238306 -0.225102 -0.171798 0.019967 -0.004912 0.263792 0.248005 0.226004 -0.513257 0.324623 -0.494197 -0.253663 -0.247228 -0.675052 -0.677272 -0.230231 0.312887 0.285972 0.218951 0.218902 0.220556 0.220484 0.210262 0.240993 0.240776 0.213817 0.237840 0.237848
chargesum: 0.00000
title: Mulliken charges with hydrogens summed into heavy atoms:
elementType: O O O O N N C C C C C C C C C C C
charge: -0.210661 -0.238306 -0.225102 -0.171798 0.019967 -0.004912 0.263792 0.248005 0.226004 -0.200370 0.324623 -0.208225 0.184190 0.193812 0.016979 0.012234 -0.230231
polarizability: 2.20909470e+02 1.01741484e+01 1.98941103e+02 1.65418506e-01 -6.90946573e-02 7.61371802e+01
1716.lowfreq: -14.0561 -9.4826 -5.3697 -0.0008 -0.0004 0.0003 4.2513 34.2367 72.7289
frequency: -13.8383 34.2362 72.7274 77.8128 95.4200 102.3373 102.9003 106.2147 140.2226 171.3689 202.8619 232.1891 233.2766 240.1651 267.4056 312.9088 337.0073 353.0860 366.6201 396.1680 422.2629 502.0527 505.0684 550.5086 561.7781 625.2428 670.6484 691.3693 725.0725 736.2058 746.4585 795.7870 824.7486 826.6372 858.1019 877.5454 908.3716 915.7269 1011.4491 1022.3551 1038.0202 1114.6011 1116.1163 1128.7918 1134.5088 1137.0100 1181.7549 1197.0034 1252.6448 1263.8387 1265.2838 1283.8181 1341.4100 1359.8133 1368.8967 1374.2203 1401.6468 1402.8300 1414.3612 1458.6966 1460.2941 1467.3801 1474.8757 1481.6730 1485.5024 1497.2581 1557.8815 1617.6967 2182.2939 2966.0005 2969.2951 3001.8340 3002.9610 3030.8043 3031.8407 3099.4107 3100.4019 3112.3503 3115.6371 3183.7714 3188.0741
redmass: 12.1060 4.2184 8.1862 3.7483 4.2010 4.9750 1.6855 1.5957 6.8654 5.7944 4.6190 1.2662 1.3155 5.8381 3.8379 5.5378 5.5024 8.8008 7.4338 5.9165 4.9770 7.1490 4.8314 7.5684 7.4814 8.3680 5.3505 7.1552 9.4028 3.1653 7.5582 4.4797 1.1014 1.1297 3.6019 1.5892 1.4478 4.0340 2.9375 2.6392 3.9885 2.2480 2.2132 1.4192 1.4372 3.0643 8.8960 3.4413 1.7454 1.1480 1.1378 2.8729 6.7913 1.4906 1.3987 8.4509 1.3165 1.2568 5.5375 1.0384 1.0388 1.3443 1.0722 1.1477 1.0819 1.7215 10.0144 7.2110 12.6312 1.0551 1.0556 1.0364 1.0366 1.1084 1.1083 1.0989 1.0988 1.1017 1.1017 1.0912 1.0905
irintensity: 0.2827 3.3099 1.5868 0.0189 1.9853 3.0837 1.9413 3.8930 4.9338 5.8840 0.3300 0.0002 2.9573 0.7219 0.0912 0.3421 0.1319 0.1208 2.9381 3.6278 0.0065 5.6757 4.5592 1.2589 1.9274 2.5724 0.4104 13.4715 5.9332 0.1786 25.6244 2.8393 8.6678 11.7559 5.4149 17.2343 27.3891 135.7392 15.9190 158.0086 11.7451 4.4093 1.6964 5.8332 5.8125 11.0747 449.5934 295.3650 37.3026 0.0192 0.0441 15.7155 28.8817 29.3533 18.1877 214.6113 124.0810 0.5031 26.8474 13.0288 13.4102 198.7240 6.2555 39.8887 3.2726 135.4613 24.6566 1.6878 12.9505 35.7611 26.3640 19.1100 17.4424 26.2286 27.7375 21.0841 21.1077 28.5344 26.6131 1.8231 9.4397
temp: 298.150 k
press: 1.00000 atm
elementType: 8 8 8 8 7 7 6 6 6 6 6 6 6 6 6 6 6 1 1 1 1 1 1 1 1 1 1 1 1
symmnumber: 1
zpe: 567537.3 jmol-1
zpe.correction: 0.216164 hartree
zpe.thermalcorrener: 0.232597 hartree
zpe.thermalcorrenthalpy: 0.233541 hartree
zpe.thermalcorrgfe: 0.171537 hartree
zpe.sumelectzpe: -835.387222 hartree
zpe.sumelectthermal: -835.370789 hartree
zpe.sumelectthermalent: -835.369845 hartree
zpe.sumelectthermalfe: -835.431849 hartree
dipole: -0.0518 1.1695 0.0068
dipole: 1.1706
quadrupole: -85.3379 -122.2012 -97.7614
quadrupole: -31.6470 -0.0680 0.0271
quadrupole: 16.4289 -20.4344 4.0055 -31.6470 -0.0680 0.0271
hfenergy: -835.6033853 hartree
pointgroup: C01 [X(C11H12N2O4)]
dipole: 0.051166 0.4576445 0.0080908 debye
polarizability: 223.4927158|6.3131434|196.3396178|0.8854277|1.2942947|76.1554193 unknown
InChI: InChI=1S/C11H12N2O4/c1-3-16-10-6-9(13(14)15)11(17-4-2)5-8(10)7-12/h5-6H,3-4H2,1-2H3
charge 0 multiplicity 1
29 atoms
O  -2.697847 0.570279 0.358911
O  2.884868 -0.282579 0.374231
O  -1.065355 -3.329145 0.335193
O  -2.946895 -2.047193 0.311647
N  -1.667192 -2.177004 0.33156
N  2.651692 3.248075 0.412551
C  -1.329824 0.366417 0.361788
C  -0.806675 -0.967617 0.349448
C  1.50458 -0.144512 0.369416
C  0.586054 -1.209556 0.353805
C  1.003792 1.195434 0.381481
C  -0.389064 1.430014 0.377799
C  -3.20986 1.968372 0.375968
C  3.451081 -1.656907 0.362155
C  -4.730427 1.861943 0.369767
C  4.967654 -1.504333 0.370686
C  1.914279 2.30711 0.397585
H  0.901474 -2.254723 0.344712
H  -0.732346 2.46651 0.387676
H  -2.83971 2.478614 1.287844
H  -2.834268 2.502668 -0.519762
H  3.08922 -2.201658 1.257107
H  3.097367 -2.182421 -0.547445
H  -5.176836 2.872757 0.379998
H  -5.080025 1.331057 -0.531152
H  -5.08619 1.310218 1.255626
H  5.443696 -2.501413 0.362063
H  5.30959 -0.944919 -0.516155
H  5.301469 -0.964289 1.2725
