program: Gaussian 09
title: 000268229
version: EM64L-G09RevD.01
frameworkgroup: C1[X(C15H14N2O4)]
method: RPBEPBE
basis: SDD
operation: Freq
keyword: #p
keyword: freq=noraman
keyword: PBEPBE/SDD
title: #p freq=noraman PBEPBE/SDD
converged: YES YES NO NO
title: Mulliken charges:
elementType: O O O O N N C C C C C C C C C C C C C C C H H H H H H H H H H H H H H
charge: -0.178282 -0.174553 -0.172774 -0.171841 -0.323061 -0.329181 0.140305 -0.403272 -0.338999 -0.391333 0.465755 0.125066 0.137857 0.106213 0.102856 -0.717183 -0.388840 -0.387883 -0.255935 -0.257262 -0.237396 0.306924 0.295548 0.218314 0.223194 0.359502 0.360257 0.226111 0.243715 0.228516 0.255146 0.227305 0.235512 0.233037 0.236660
chargesum: 0.00000
title: Mulliken charges with hydrogens summed into heavy atoms:
elementType: O O O O N N C C C C C C C C C C C C C C C
charge: -0.178282 -0.174553 -0.172774 -0.171841 0.036441 0.031076 0.140305 -0.096348 -0.043451 0.050175 0.465755 0.125066 0.137857 0.106213 0.102856 -0.018840 -0.133694 -0.160577 -0.020423 -0.024225 -0.000736
polarizability: 1.97683426e+02 -1.04604513e+01 1.72093965e+02 -1.25773219e+01 -2.62078295e+01 1.56627411e+02
1716.lowfreq: -14.3988 -7.8932 -0.0006 -0.0004 0.0004 8.6329 46.0165 57.4724 68.5830
frequency: 45.9520 57.4709 68.5504 77.0312 94.8277 115.1675 128.6812 138.5373 165.5135 184.5637 199.0578 233.7259 265.7624 288.7004 314.5972 324.7414 341.1607 359.0742 386.1185 403.0562 446.6639 517.8465 523.3881 540.7703 550.8730 559.4273 588.8875 613.1543 619.1096 622.0383 633.7267 669.7183 705.9858 750.2555 761.3720 768.7023 786.1683 796.6171 843.1250 852.5469 868.5593 909.9715 919.4944 931.6538 939.9547 951.4211 975.7418 979.9079 990.8119 1001.1590 1031.1394 1043.1951 1080.0619 1091.0632 1097.3880 1150.4298 1161.0510 1178.9139 1197.0125 1212.3959 1220.3804 1239.1738 1269.0703 1278.8070 1288.7387 1298.9654 1309.7104 1327.7821 1335.2507 1339.6801 1373.2317 1377.3571 1378.9785 1395.8902 1437.2014 1469.4822 1483.6455 1489.0282 1489.5195 1591.2295 1612.5835 1624.6705 1632.7436 1657.8738 1662.9582 2985.9010 2990.1229 3036.1255 3081.8295 3091.3247 3098.0204 3101.3446 3126.4118 3133.4819 3145.2905 3154.5526 3169.6108 3482.4095 3484.0908
redmass: 4.4437 8.1989 6.4270 2.6928 7.0191 5.8116 10.4737 5.4565 4.5186 5.3846 2.7285 1.6346 6.5196 2.9085 3.5032 4.7517 9.5049 6.6178 9.9145 2.8029 3.7904 6.6501 9.3560 3.8335 6.1893 4.1084 4.6894 5.1797 6.0275 4.9130 7.2875 3.8172 1.6688 5.4863 1.4931 1.9595 1.4025 1.3961 2.9313 1.2977 4.5343 3.3148 1.6210 3.4215 3.2377 3.4241 2.2082 1.4179 5.7918 1.3344 2.4041 2.3965 3.5540 1.7334 1.7968 3.5803 3.9392 1.0635 1.9363 1.4175 1.5679 2.4438 1.6280 1.8972 1.8445 2.8520 2.0193 1.6101 1.4038 1.4058 1.7291 2.2749 3.3046 1.2054 2.2479 1.0805 1.0436 1.1976 1.6939 5.7888 5.9060 10.5012 5.3802 6.0431 11.4000 1.0588 1.0373 1.1008 1.0991 1.1003 1.0848 1.0860 1.0858 1.0866 1.0916 1.0955 1.1015 1.0763 1.0763
irintensity: 0.0563 0.0502 0.1427 0.0671 0.0170 0.5730 6.1897 3.2362 2.8257 1.5744 0.6045 0.1645 0.3510 0.3825 4.3054 1.4579 4.7081 12.3942 21.1301 0.0803 5.6809 31.6106 0.4697 6.8405 0.3503 20.0633 2.0218 0.6169 0.6143 0.6110 0.6403 12.5176 55.1863 7.2600 3.0173 70.4857 60.9478 129.8551 5.2405 0.5460 5.7204 2.0939 1.9224 4.2684 0.8434 3.1198 2.9909 0.2714 1.4165 0.1530 6.0775 5.1914 4.3443 6.8264 7.1163 27.8196 5.1057 0.9537 12.5147 3.3187 77.0620 146.3536 28.7392 123.2288 147.8680 61.6248 92.1548 2.0607 9.3434 18.7218 1.2479 5.5964 9.8329 16.3878 13.8400 2.9272 8.4626 5.3221 20.7266 1.4628 2.7894 221.2147 7.3343 771.2991 106.7672 24.0887 16.9177 16.6918 31.1026 31.1795 0.5047 0.2218 5.7368 0.0563 16.2360 23.5871 15.3746 56.5687 50.4024
temp: 298.150 k
press: 1.00000 atm
elementType: 8 8 8 8 7 7 6 6 6 6 6 6 6 6 6 6 6 6 6 6 6 1 1 1 1 1 1 1 1 1 1 1 1 1 1
symmnumber: 1
zpe: 704112.8 jmol-1
zpe.correction: 0.268182 hartree
zpe.thermalcorrener: 0.286065 hartree
zpe.thermalcorrenthalpy: 0.287009 hartree
zpe.thermalcorrgfe: 0.222628 hartree
zpe.sumelectzpe: -988.943154 hartree
zpe.sumelectthermal: -988.925272 hartree
zpe.sumelectthermalent: -988.924327 hartree
zpe.sumelectthermalfe: -988.988708 hartree
dipole: -3.5190 -1.4669 -2.1697
dipole: 4.3866
quadrupole: -116.3743 -140.0388 -126.5284
quadrupole: 0.0655 -0.1309 8.9410
quadrupole: 11.2728 -12.3916 1.1188 0.0655 -0.1309 8.9410
hfenergy: -989.2113365 hartree
pointgroup: C01 [X(C15H14N2O4)]
dipole: 1.4129263 0.3681777 -0.9200953 debye
polarizability: 196.5974269|-9.0624136|181.1981138|15.7238221|21.3235462|148.6092611 unknown
InChI: InChI=1S/C15H14N2O4/c1-2-15(8-6-4-3-5-7-8)9-11(18)16-13(20)10(15)14(21)17-12(9)19/h3-7,9-10,16-17H,2H2,1H3
charge 0 multiplicity 1
35 atoms
O  -0.537836 1.339337 2.833325
O  -0.517578 -2.957935 1.089216
O  -2.851685 2.417202 0.240067
O  -2.923028 -1.896634 -1.442859
N  -0.628238 -0.792304 1.919399
N  -2.870692 0.205976 -0.462878
C  -0.007672 0.247889 -0.654122
C  -0.729427 1.17099 0.378385
C  -0.76027 -1.124691 -0.546147
C  -0.13423 0.803693 -2.115934
C  1.493918 0.069606 -0.321691
C  -0.618005 0.614065 1.813802
C  -0.617764 -1.730035 0.863675
C  -2.22272 1.34916 0.0517
C  -2.259738 -0.999239 -0.871372
C  0.462611 2.210486 -2.331102
C  2.200177 0.962815 0.524668
C  2.223697 -0.979975 -0.94102
C  3.585864 0.80436 0.754066
C  3.606528 -1.141003 -0.71394
C  4.296454 -0.24806 0.137612
H  -0.31296 2.188244 0.410729
H  -0.368829 -1.878599 -1.245343
H  -1.197374 0.811802 -2.426493
H  0.377499 0.085577 -2.785164
H  -0.540633 -1.176275 2.868993
H  -3.874803 0.300276 -0.662845
H  -0.08473 2.985232 -1.764141
H  1.525393 2.249904 -2.035164
H  0.399061 2.484715 -3.39899
H  1.687955 1.793143 1.020675
H  1.71978 -1.687108 -1.609926
H  4.105737 1.505347 1.416055
H  4.143065 -1.963735 -1.198844
H  5.369676 -0.372122 0.317508
