program: Gaussian 09
title: 000023288
version: EM64L-G09RevD.01
frameworkgroup: C1[X(C16H23N3)]
method: RPBEPBE
basis: SDD
operation: Freq
keyword: #pfreq=noraman
keyword: PBEPBE/SDD
title: #p freq=noraman PBEPBE/SDD
converged: YES YES NO NO
title: Mulliken charges:
elementType: N N N C C C C C C C C C C C C C C C C H H H H H H H H H H H H H H H H H H H H H H H
charge: -0.075148 -0.401864 -0.171280 -0.361218 -0.353650 -0.397236 -0.390716 -0.398666 -0.499217 0.383011 0.114978 0.218231 -0.463211 -0.577322 0.428922 -0.364769 -0.361728 -0.648019 -0.649600 0.164373 0.241053 0.206847 0.162400 0.189353 0.204566 0.198998 0.188124 0.210207 0.187354 0.181434 0.215622 0.266677 0.295966 0.274113 0.217746 0.231714 0.225069 0.211795 0.225644 0.230630 0.209959 0.228862
chargesum: 0.00000
title: Mulliken charges with hydrogens summed into heavy atoms:
elementType: N N N C C C C C C C C C C C C C C C C
charge: -0.075148 -0.105899 -0.171280 0.044207 0.015597 -0.003318 -0.003594 -0.001105 -0.102162 0.383011 0.114978 0.218231 -0.196534 -0.303209 0.428922 -0.147023 -0.130014 0.014488 0.019851
polarizability: 2.27193456e+02 -1.58385821e+01 2.30483900e+02 1.79130036e+01 6.16942542e+00 1.32968800e+02
1716.lowfreq: -0.0006 0.0002 0.0007 3.7873 5.0690 14.6519 24.3022 44.2556 46.5132
frequency: 23.6627 44.2474 46.1670 51.7577 74.1188 113.3833 115.1682 156.0083 181.1245 214.1107 218.9296 238.7766 254.6761 287.3277 302.8832 306.1539 342.2965 374.1719 387.5546 406.7767 432.6751 448.3271 454.6973 469.5090 491.5596 522.9523 564.9179 587.1519 598.7914 645.2189 686.6899 742.6761 753.4570 766.1921 782.6594 795.5569 800.1609 806.9197 851.8755 857.0483 857.7701 881.6670 905.7237 912.0635 959.1560 961.8346 981.2657 990.5024 1045.5762 1054.2363 1059.2114 1079.5534 1096.1004 1103.2206 1107.9476 1112.9146 1122.2945 1145.9727 1149.3001 1150.2856 1171.5616 1191.9761 1226.6808 1247.6810 1258.5157 1261.2553 1263.7018 1270.3340 1285.3271 1293.9990 1324.9202 1330.7919 1339.7384 1343.4720 1348.0964 1350.4564 1360.0872 1389.0327 1394.2282 1421.2100 1432.9374 1451.5533 1452.2848 1457.5931 1459.7168 1461.2846 1466.1080 1466.6730 1470.2183 1471.0069 1481.4362 1490.9316 1501.9134 1513.9423 1564.4286 1591.6907 1643.0443 2803.3751 2810.2294 2829.4207 2919.4567 2929.7671 2964.9109 2968.4621 2978.7626 2980.5421 2981.8430 2984.0512 3012.1162 3029.6287 3041.8315 3044.8665 3051.8272 3084.4803 3094.2537 3126.9603 3166.1085 3175.9712 3214.4020 3618.1525
redmass: 3.8259 2.7505 3.0011 3.2105 2.8466 2.2884 2.9834 2.4035 2.9790 1.6321 1.4294 1.9058 2.6262 2.6991 3.1526 2.9980 3.9086 5.1113 1.7160 3.4237 2.8895 2.8884 1.8308 1.6507 3.2850 3.4234 2.0160 3.0413 3.1120 3.2066 4.6459 3.8030 3.7902 2.7642 1.8320 1.7232 4.3206 1.4918 2.2067 1.5928 1.6961 4.7444 2.2788 1.3311 1.2956 2.4432 1.8875 2.5447 2.2209 2.1403 1.8042 1.3627 1.6106 2.2032 1.3114 1.2413 2.3534 1.5085 2.1111 1.3470 1.5379 1.3153 1.7733 1.9889 1.3253 1.6851 1.7042 1.4750 1.5906 1.9315 2.0495 1.5005 1.4182 1.5106 1.5198 2.5989 1.4570 1.9900 2.8417 1.9364 1.4305 1.0934 1.4533 1.1202 1.0449 1.0873 2.6418 1.0969 1.0560 1.0945 1.0973 1.4759 1.3892 1.3110 5.9022 5.7540 7.4168 1.0716 1.0712 1.0696 1.0373 1.0402 1.0618 1.0856 1.0988 1.0619 1.1021 1.0616 1.0865 1.0961 1.1020 1.0889 1.1030 1.0948 1.0929 1.0891 1.0931 1.0911 1.0979 1.0808
irintensity: 0.2818 2.6016 0.2474 3.3696 2.7415 1.3460 1.3765 3.1101 0.3131 0.2675 1.4776 0.4206 0.0369 2.6273 3.4182 3.5942 0.5087 4.8350 3.5263 7.0589 1.2409 2.2858 53.7428 47.9617 0.8702 0.8158 1.5909 7.1412 8.1244 10.7692 3.7605 4.2575 2.4077 20.0736 58.4060 13.5081 4.4154 2.0573 16.1423 21.4415 3.1497 3.3486 7.5884 1.0478 2.8593 26.5856 13.6004 28.3430 7.9795 15.1789 23.7869 5.3097 52.6741 18.5299 1.5082 0.0203 3.0590 1.5466 21.5490 5.7736 11.8501 0.8884 5.2820 17.8683 0.9752 27.1157 39.9657 6.5844 4.1090 23.9974 16.6577 4.7328 1.5476 21.9960 0.2503 63.6402 4.0178 2.2998 21.9255 0.9384 10.4851 8.2065 56.6236 7.0970 1.6292 12.3462 18.7034 6.5321 15.0284 14.8541 7.3736 37.7898 1.8330 196.0362 31.1704 58.5528 88.3874 46.1195 55.2806 266.8490 146.3264 82.1317 42.2127 29.0880 14.7107 30.1611 98.2232 28.3094 67.2117 67.1170 36.9913 7.9218 104.1430 4.9227 58.1461 15.7653 21.9899 7.4759 1.6573 60.8467
temp: 298.150 k
press: 1.00000 atm
elementType: 7 7 7 6 6 6 6 6 6 6 6 6 6 6 6 6 6 6 6 1 1 1 1 1 1 1 1 1 1 1 1 1 1 1 1 1 1 1 1 1 1 1
symmnumber: 1
zpe: 951845.7 jmol-1
zpe.correction: 0.362539 hartree
zpe.thermalcorrener: 0.380839 hartree
zpe.thermalcorrenthalpy: 0.381783 hartree
zpe.thermalcorrgfe: 0.315325 hartree
zpe.sumelectzpe: -786.307552 hartree
zpe.sumelectthermal: -786.289252 hartree
zpe.sumelectthermalent: -786.288308 hartree
zpe.sumelectthermalfe: -786.354766 hartree
dipole: 0.3648 0.2851 0.3465
dipole: 0.5783
quadrupole: -104.7467 -93.8618 -117.9390
quadrupole: -2.1558 3.9429 3.9329
quadrupole: 0.7691 11.6540 -12.4232 -2.1558 3.9429 3.9329
hfenergy: -786.6700906 hartree
pointgroup: C01 [X(C16H23N3)]
dipole: -0.1499801 0.104592 -0.1353682 debye
polarizability: 227.0064642|15.9412016|231.1202546|15.5699455|-8.2763077|132.5194373 unknown
InChI: InChI=1S/C16H23N3/c1-18(2)14-6-7-16-15(10-14)13(11-17-16)12-19-8-4-3-5-9-19/h6-7,10-11,17H,3-5,8-9,12H2,1-2H3
charge 0 multiplicity 1
42 atoms
N  2.282998 0.146631 0.367162
N  -1.279994 3.149665 -0.29728
N  -2.635224 -2.283924 0.258812
C  2.5548 0.373778 -1.073354
C  3.481408 -0.364668 1.075971
C  3.008684 -0.931227 -1.75894
C  3.964482 -1.693308 0.45992
C  4.248288 -1.52288 -1.05008
C  1.717355 1.346652 1.044887
C  0.397128 1.795152 0.472148
C  -0.790595 0.981213 0.255783
C  -1.823941 1.855656 -0.225455
C  0.056707 3.102771 0.12002
C  -1.051883 -0.402255 0.418638
C  -2.345967 -0.912046 0.114053
C  -3.111248 1.369463 -0.530799
C  -3.36325 -0.003787 -0.356787
C  -3.974421 -2.794943 -0.03803
C  -1.595941 -3.19003 0.75054
H  3.347866 1.159008 -1.211657
H  1.630414 0.754406 -1.542156
H  3.22034 -0.510761 2.141948
H  4.323125 0.380406 1.040044
H  3.226781 -0.73004 -2.825693
H  2.174221 -1.658232 -1.718253
H  3.176188 -2.458086 0.603228
H  4.87123 -2.0395 0.993089
H  4.532526 -2.491584 -1.503801
H  5.110336 -0.836486 -1.185396
H  2.436724 2.208371 1.022169
H  1.589552 1.071003 2.112474
H  0.670618 4.002006 0.143562
H  -1.773626 3.982325 -0.608005
H  -0.236936 -1.049846 0.748732
H  -3.906366 2.029685 -0.896289
H  -4.361671 -0.381629 -0.593468
H  -4.753921 -2.33299 0.605138
H  -3.997725 -3.882909 0.136785
H  -4.263806 -2.618875 -1.095824
H  -0.705645 -3.19589 0.086804
H  -1.992562 -4.217456 0.795259
H  -1.248548 -2.911937 1.768705
