program: Gaussian 09
title: 000268189
version: EM64L-G09RevD.01
frameworkgroup: C1[X(C7H12N2O3)]
method: RPBEPBE
basis: SDD
operation: Freq
keyword: #p
keyword: freq=noraman
keyword: PBEPBE/SDD
title: #p freq=noraman PBEPBE/SDD
converged: YES YES NO NO
title: Mulliken charges:
elementType: O O O N N C C C C C C C H H H H H H H H H H H H
charge: -0.286634 -0.228494 -0.237279 -0.410653 -0.391490 0.214872 0.033676 0.174686 -0.729866 -0.725226 0.177833 -0.508269 0.208848 0.321537 0.221222 0.242091 0.240161 0.226582 0.229347 0.220931 0.347074 0.240050 0.218435 0.200568
chargesum: 0.00000
title: Mulliken charges with hydrogens summed into heavy atoms:
elementType: O O O N N C C C C C C C
charge: -0.286634 -0.228494 -0.237279 -0.089116 -0.044416 0.214872 0.242523 0.174686 -0.026393 -0.048367 0.177833 0.150784
polarizability: 1.02326340e+02 1.15166907e+01 9.15312031e+01 6.43339145e+00 4.79530337e-01 9.42223464e+01
1716.lowfreq: -9.4121 -9.2209 0.0003 0.0004 0.0007 1.0371 45.5940 60.7322 75.7238
frequency: 45.5152 60.6932 75.6975 140.4089 166.2273 192.8938 196.6762 201.7187 213.9515 269.0606 300.3765 317.3291 333.0121 395.1369 422.6932 442.0612 514.6642 599.8869 605.5218 619.8326 640.8838 695.9713 731.1930 748.8599 801.8387 890.3668 940.3279 973.1235 990.3890 1024.8326 1074.2110 1092.8418 1113.3616 1120.1289 1138.2602 1156.2803 1200.4519 1245.2315 1305.9325 1312.1973 1321.7846 1335.7496 1360.0294 1382.7726 1390.5234 1437.2596 1458.5921 1464.8274 1468.4186 1470.0627 1475.9046 1485.5472 1681.7095 1724.2832 2939.7525 2957.5691 2988.5809 2996.0977 3020.5563 3084.2450 3087.8049 3097.8379 3102.3728 3108.0964 3593.9525 3608.6014
redmass: 3.6297 2.7099 4.5200 2.6615 5.9772 1.3828 1.2407 1.3616 2.1772 2.3216 2.6908 4.0158 3.6228 5.8888 3.2852 1.2452 4.1862 6.4315 4.0579 2.7003 1.4648 7.9419 6.7880 3.1834 2.7046 2.1275 2.1503 2.6841 2.4468 1.8953 2.9898 1.9702 1.4830 2.7143 2.4483 1.8441 2.4081 4.2796 2.0859 1.8428 1.4790 1.9963 1.6922 1.2351 1.2337 1.1357 1.0544 1.0574 1.0526 1.0526 1.0540 1.0495 8.4182 9.5227 1.0339 1.0836 1.0361 1.0352 1.1033 1.0988 1.1000 1.1000 1.1004 1.0982 1.0802 1.0798
irintensity: 2.5686 3.8491 0.3182 1.1088 0.8588 1.9375 0.5308 0.8221 0.8674 1.5315 1.6084 8.3781 0.7838 16.6643 17.1798 112.0575 5.6555 13.1147 2.9248 31.3690 114.9580 1.7165 64.2826 15.9231 7.0284 5.2660 6.1051 11.8629 37.2012 11.7320 90.0424 31.8906 6.8446 21.1031 29.2391 1.8719 2.1694 91.0282 135.0330 36.0717 24.5345 59.5597 7.6460 15.9832 23.5739 1.7474 9.1026 3.0460 17.9886 5.8040 16.4416 11.1146 542.0138 374.1246 70.7350 23.6364 13.7398 17.6586 57.1872 28.4651 29.0020 16.1375 16.8727 23.0602 68.2594 33.0362
temp: 298.150 k
press: 1.00000 atm
elementType: 8 8 8 7 7 6 6 6 6 6 6 6 1 1 1 1 1 1 1 1 1 1 1 1
symmnumber: 1
zpe: 504542.8 jmol-1
zpe.correction: 0.192170 hartree
zpe.thermalcorrener: 0.205188 hartree
zpe.thermalcorrenthalpy: 0.206132 hartree
zpe.thermalcorrgfe: 0.152908 hartree
zpe.sumelectzpe: -608.203497 hartree
zpe.sumelectthermal: -608.190480 hartree
zpe.sumelectthermalent: -608.189536 hartree
zpe.sumelectthermalfe: -608.242759 hartree
dipole: 3.8853 2.0793 -0.7323
dipole: 4.4671
quadrupole: -71.6889 -67.4286 -79.4818
quadrupole: -4.1781 -7.7783 -7.3180
quadrupole: 1.1775 5.4379 -6.6154 -4.1781 -7.7783 -7.3180
hfenergy: -608.3956677 hartree
pointgroup: C01 [X(C7H12N2O3)]
dipole: 1.5144098 -0.4347195 0.7787315 debye
dipolederiv: -0.6401741 -0.2115944 0.1757343 -0.2750966 -0.5566651 0.2893126 0.2262475 0.1953399 -0.7803299 -0.5363497 0.1684323 0.0664877 0.1934482 -0.758982 -0.3160843 0.0991371 -0.3721099 -0.7422454 -0.9327644 0.4766066 -0.0380721 0.5644826 -0.8802043 -0.0486787 0.0285472 -0.1127921 -0.4908186 -0.9185388 0.1639096 -0.1983988 0.2012328 -0.588962 0.2431781 -0.2541472 0.2040884 -0.6314339 -0.7931608 0.466815 0.2228714 0.3770798 -0.9261014 -0.4332945 0.0485357 -0.2687568 -0.6273337 0.2780061 -0.1156531 -0.179063 -0.2104319 0.408984 -0.1064028 -0.3372781 -0.0310791 -0.1603453 0.3582203 0.1250098 0.1385489 0.2228581 0.4120891 -0.1968341 -0.017109 -0.1403011 0.5619974 0.9732621 -0.6164725 -0.1020301 -0.4826242 0.9839792 0.4667045 0.1759857 0.3081568 0.811316 -0.0407049 -0.0197742 0.0395316 0.0143733 -0.0520057 0.0019039 0.0414506 0.0704175 0.032886 -0.0937382 -0.0518314 -0.1328333 -0.1115359 0.0208419 -0.0207402 -0.0332359 0.0111482 -0.1218581 1.3573507 -0.7493315 0.2716952 -0.8735625 1.2546868 0.305473 0.2327167 0.3767764 1.2108675 0.5288882 0.1712552 -0.2489255 0.0870402 0.2607132 0.0086171 -0.2072148 -0.0552344 0.4717423 -0.0089482 0.0711438 -0.0058943 0.0333387 -0.0919746 -0.0121655 0.0570559 -0.0776898 -0.0326855 0.2605486 0.0699072 -0.0873577 0.0890766 0.2201549 -0.066784 -0.0645119 -0.0608465 0.2218175 0.0767967 0.001449 -0.0958334 -0.0121671 0.0563961 -0.0402026 -0.0856104 -0.0119138 -0.1044347 -0.1019529 -0.0876648 0.0311434 -0.0578245 0.0597179 0.0222138 0.0065732 0.0124765 0.0871767 0.0313653 0.1017618 0.0331438 0.0976253 -0.0047197 -0.0090341 0.0504775 -0.0611143 0.051754 0.129484 0.0153815 -0.001735 0.0280613 -0.0599817 0.1241733 -0.0041379 0.107193 -0.0320573 -0.1310331 -0.07435 0.0200296 -0.0884237 0.0683536 -0.0118071 0.0556468 0.0129679 0.0837699 0.041925 0.1077198 0.0836748 0.0744124 -0.0174795 -0.0954628 0.0218661 -0.0648567 0.023553 0.2721419 0.0762839 -0.0236823 0.1047787 0.2419554 -0.0439486 -0.0058618 -0.0680167 0.2271009 0.0725486 0.0360838 -0.015623 -0.0010084 -0.0383969 0.1276003 0.0264169 0.1194586 -0.001147 0.0189384 -0.030797 0.0694768 0.0586006 -0.0855694 -0.1618742 0.0605929 -0.0616913 -0.0329865 -0.2021107 -0.0942904 -0.0228892 -0.0337337 0.0731701 -0.0258633 -0.1221429 -0.0316206 -0.0263053 unknown
polarizability: 101.7658484|-13.0007411|93.7641386|3.2020537|1.2177793|92.5499029 unknown
InChI: InChI=1S/C7H12N2O3/c1-4(12-3)7(2)5(10)8-6(11)9-7/h4,8-9H,1-3H3
charge 0 multiplicity 1
24 atoms
O  1.445695 1.015907 -0.54744
O  -0.158123 -1.739329 -1.629283
O  -2.619454 1.787292 0.304932
N  -0.796934 0.472146 1.09844
N  -1.623365 -0.004456 -0.930693
C  0.0781 -0.604229 0.598023
C  1.54934 -0.139835 0.361111
C  -0.550561 -0.88044 -0.803812
C  0.006756 -1.879104 1.469231
C  2.317137 0.236979 1.638906
C  -1.767424 0.875721 0.192569
C  2.606788 1.183827 -1.423433
H  2.05674 -0.979818 -0.163051
H  -0.634312 0.996518 1.955336
H  0.38384 -1.686445 2.488496
H  -1.037421 -2.225366 1.550905
H  0.604842 -2.686419 1.011965
H  2.42744 -0.625609 2.319555
H  3.332462 0.587078 1.382143
H  1.810787 1.058679 2.176836
H  -2.21593 0.076301 -1.756691
H  2.37663 2.049391 -2.063923
H  2.760551 0.285815 -2.056404
H  3.534415 1.392797 -0.851518
