program: Gaussian 09
title: 000268194
version: EM64L-G09RevD.01
frameworkgroup: C1[X(C19H23NO2)]
method: RPBEPBE
basis: SDD
operation: Freq
keyword: #p
keyword: freq=noraman
keyword: PBEPBE/SDD
title: #p freq=noraman PBEPBE/SDD
converged: YES YES NO NO
title: Mulliken charges:
elementType: O O N C C C C C C C C C C C C C C C C C C C H H H H H H H H H H H H H H H H H H H H H H H
charge: -0.335558 -0.268190 -0.472080 0.044633 -0.461784 -0.458532 0.065190 -0.464844 -0.449092 -0.403377 -0.712445 0.239129 0.343328 0.154777 0.433694 -0.386255 -0.339403 -0.471302 -0.233544 -0.425480 -0.273783 -0.243722 0.185915 0.194944 0.215229 0.203264 0.199590 0.234875 0.206050 0.213229 0.232049 0.203586 0.196575 0.199167 0.218911 0.209855 0.216597 0.332226 0.300688 0.193368 0.238024 0.227142 0.239055 0.228412 0.229891
chargesum: 0.00000
title: Mulliken charges with hydrogens summed into heavy atoms:
elementType: O O N C C C C C C C C C C C C C C C C C C C
charge: -0.335558 -0.268190 -0.139854 0.230548 -0.051611 -0.055678 0.300065 -0.045565 -0.013457 -0.007635 -0.067083 0.239129 0.343328 0.154777 0.433694 -0.085567 -0.146035 -0.233279 -0.006402 -0.186425 -0.045370 -0.013831
polarizability: 3.29438361e+02 -1.07744162e+01 2.34003089e+02 -6.64179384e+00 5.07994026e+00 1.26353455e+02
1716.lowfreq: -25.6555 -4.1048 -0.0009 0.0004 0.0012 3.8776 10.4558 22.6015 33.7803
frequency: -17.3409 22.2970 33.7126 54.7707 70.3356 77.7625 93.3163 136.2458 141.7980 177.1360 178.4210 203.8338 204.5517 224.9359 260.8519 270.3590 280.9855 331.1011 359.6272 408.8983 417.2645 421.0793 438.2498 448.5699 468.5575 471.7744 504.4466 511.6003 557.7547 558.3751 625.2258 630.3763 646.5784 682.8026 700.9575 739.1473 748.1945 765.7400 782.8586 783.2113 784.1889 795.9919 806.9110 853.5975 869.1043 870.4173 901.6840 911.3027 919.4116 922.7941 950.7623 951.4138 965.8192 984.4925 991.5636 993.2897 1013.6618 1032.8155 1039.6482 1054.8715 1060.2294 1062.3711 1094.7228 1097.4235 1114.0652 1151.2794 1159.0373 1160.6640 1174.9171 1182.3662 1195.4352 1216.5061 1230.1221 1236.3266 1243.3760 1267.8408 1271.9190 1279.5855 1289.8748 1296.9072 1303.4624 1314.1414 1330.4180 1340.4234 1347.4328 1350.7743 1363.3366 1369.3267 1390.3181 1409.3862 1420.3294 1443.9412 1454.8406 1457.2327 1460.9649 1466.5883 1470.0182 1476.1715 1480.1299 1486.5164 1493.8530 1540.8964 1591.6427 1598.7246 1635.0914 1660.2983 2933.6373 2957.5228 2959.5925 2967.5087 2975.1556 2984.2138 2986.3726 3009.3745 3011.0939 3028.4951 3040.0934 3051.9858 3060.7615 3068.3196 3074.1264 3111.9726 3125.0539 3129.7515 3142.7317 3153.8286 3163.1762 3188.7913 3565.5233
redmass: 3.1424 4.8598 4.2310 6.1297 4.6464 3.8727 2.2080 4.1037 4.1154 4.0078 2.6094 3.0197 2.0075 1.5673 2.5724 3.6219 4.9763 4.7105 3.1244 2.2136 3.0921 3.9344 3.0613 2.3245 3.3141 3.3691 4.7576 6.6732 3.5762 2.3914 2.2420 2.6148 3.3130 7.0085 6.1146 1.2920 1.6266 4.1143 2.0411 3.9242 1.6102 1.9765 1.4315 2.4850 1.8746 2.7207 1.3857 3.4620 2.6297 1.3580 1.4068 1.9828 3.2662 1.3322 1.3593 2.4745 1.8080 2.8009 1.9816 1.2885 2.4775 1.7153 2.3371 2.2745 2.2360 1.7085 2.3402 1.9254 2.0359 1.1218 1.2872 1.3364 1.3856 1.8905 1.2576 1.2959 1.5722 1.2556 2.3343 1.2230 1.2944 1.2761 1.3790 1.6213 1.5318 1.5844 1.6495 2.0442 1.2119 2.8981 5.4470 2.5131 2.3111 1.0841 1.0916 1.0834 1.0731 1.0957 1.0535 1.0581 2.5980 2.7965 7.3725 5.2916 6.3327 7.3826 1.0811 1.0604 1.0639 1.0635 1.0366 1.0615 1.0641 1.0985 1.0855 1.0973 1.0960 1.1020 1.1023 1.0994 1.0993 1.0862 1.0874 1.0868 1.0939 1.0966 1.1004 1.0944 1.0749
irintensity: 0.0177 0.1818 0.1289 3.3902 1.3339 0.5123 0.1789 0.1819 1.8739 2.9517 1.2950 0.1604 0.7036 2.1185 0.3605 2.5958 10.0032 10.2970 0.8375 3.6985 8.8458 5.8400 0.6032 4.1698 1.4558 0.1084 0.1286 0.1957 0.6244 0.0469 23.1627 15.5308 5.8678 7.2206 37.2395 24.8033 4.0120 1.8006 71.3669 3.6879 2.4843 3.1811 71.7531 12.6621 19.1773 6.6631 14.2722 3.8735 3.4963 2.7286 2.1094 5.2411 78.3004 1.0825 4.2932 272.5614 14.0146 60.1885 1.6347 2.2112 141.1560 8.0227 36.1163 2.3650 3.0784 225.1153 3.4344 261.3079 24.6265 13.3640 2.5090 3.7167 0.4274 3.9349 2.1434 6.6420 16.6105 2.3915 22.3133 1.0312 0.7132 0.7213 0.7430 20.5190 0.1367 0.8791 55.9046 20.2117 15.0756 33.1246 103.1138 3.2111 0.6598 1.1002 9.3831 7.4272 16.4690 0.6979 9.6504 21.3182 409.1358 454.3611 52.9083 10.2103 11.2610 214.5269 7.4561 9.7978 24.7587 88.5802 34.3191 10.8695 21.1018 16.3634 18.5768 60.1998 48.2729 24.5448 51.2494 61.7335 60.3258 17.7092 0.8707 2.0837 33.0274 33.4711 28.9797 4.7102 27.3367
temp: 298.150 k
press: 1.00000 atm
elementType: 8 8 7 6 6 6 6 6 6 6 6 6 6 6 6 6 6 6 6 6 6 6 1 1 1 1 1 1 1 1 1 1 1 1 1 1 1 1 1 1 1 1 1 1 1
symmnumber: 1
zpe: 993963.7 jmol-1
zpe.correction: 0.378581 hartree
zpe.thermalcorrener: 0.397946 hartree
zpe.thermalcorrenthalpy: 0.398890 hartree
zpe.thermalcorrgfe: 0.329923 hartree
zpe.sumelectzpe: -941.443957 hartree
zpe.sumelectthermal: -941.424591 hartree
zpe.sumelectthermalent: -941.423647 hartree
zpe.sumelectthermalfe: -941.492615 hartree
dipole: 0.9547 2.2549 0.2996
dipole: 2.4669
quadrupole: -110.8682 -126.9075 -135.5589
quadrupole: -1.2118 -0.5034 0.7311
quadrupole: 13.5766 -2.4626 -11.1141 -1.2118 -0.5034 0.7311
hfenergy: -941.8225377 hartree
pointgroup: C01 [X(C19H23N1O2)]
dipole: -0.3651924 0.8943496 -0.09361 debye
polarizability: 329.8155733|10.1973967|234.0469695|-0.4890311|-0.5390339|125.9323623 unknown
InChI: InChI=1S/C19H23NO2/c1-2-14-10-12-16(13-11-14)22-19(21)20-18-9-5-7-15-6-3-4-8-17(15)18/h3-9,14,16,20H,2,10-13H2,1H3
charge 0 multiplicity 1
45 atoms
O  -1.2076 0.362209 0.190793
O  -0.426572 -1.865848 0.140857
N  1.016884 0.023441 0.118419
C  -5.47011 0.361996 -0.608747
C  -4.963801 0.560694 0.844346
C  -4.585016 -0.686166 -1.33396
C  -2.624546 -0.123567 0.163869
C  -3.461083 0.933731 0.894475
C  -3.082023 -0.317534 -1.291763
C  -6.964519 -0.046018 -0.667177
C  -7.944555 1.025317 -0.139989
C  -0.208619 -0.628151 0.145518
C  2.314664 -0.550152 0.093727
C  3.451459 0.350017 0.024336
C  4.783241 -0.224904 0.012622
C  2.511548 -1.939954 0.137652
C  3.331646 1.779641 -0.03596
C  4.949133 -1.647475 0.062486
C  3.830903 -2.478751 0.120894
C  5.920662 0.647083 -0.051809
C  4.459287 2.602937 -0.099421
C  5.769757 2.032966 -0.106027
H  -5.35584 1.332011 -1.143385
H  -5.133397 -0.379249 1.411738
H  -5.548151 1.349352 1.353716
H  -4.91015 -0.79018 -2.387413
H  -4.737376 -1.677727 -0.857155
H  -2.655222 -1.093637 0.6973
H  -3.301063 1.915781 0.406891
H  -3.116246 1.026337 1.941072
H  -2.475162 -1.106334 -1.772641
H  -2.911057 0.627309 -1.845054
H  -7.102187 -0.987622 -0.095263
H  -7.223098 -0.283137 -1.719615
H  -7.793092 1.226688 0.936106
H  -7.816288 1.980982 -0.683252
H  -8.993513 0.701998 -0.271646
H  0.939948 1.040712 0.126148
H  1.644301 -2.601105 0.184291
H  2.349253 2.267315 -0.040228
H  5.961919 -2.065572 0.05243
H  3.953445 -3.566617 0.15719
H  6.920977 0.19794 -0.058958
H  4.338884 3.690647 -0.146203
H  6.647575 2.686095 -0.155511
