program: Gaussian 09
title: 000268177
version: EM64L-G09RevD.01
frameworkgroup: C1[X(C17H21ClO2)]
method: RPBEPBE
basis: SDD
operation: Freq
keyword: #p
keyword: freq=noraman
keyword: PBEPBE/SDD
title: #p freq=noraman PBEPBE/SDD
converged: YES YES NO NO
title: Mulliken charges:
elementType: Cl O O C C C C C C C C C C C C C C C C C H H H H H H H H H H H H H H H H H H H H H
charge: -0.046356 -0.309686 -0.256323 -0.006178 -0.443783 -0.422375 -0.384932 -0.379151 -0.398120 -0.464745 -0.474169 -0.158435 -0.173251 0.199521 0.225392 -0.330894 -0.327676 -0.209902 -0.201286 -0.094468 0.239872 0.209627 0.221576 0.216441 0.233218 0.205554 0.209561 0.192788 0.219100 0.205771 0.200268 0.204748 0.201328 0.202621 0.204115 0.207682 0.211181 0.276556 0.274921 0.261073 0.258818
chargesum: 0.00000
title: Mulliken charges with hydrogens summed into heavy atoms:
elementType: Cl O O C C C C C C C C C C C C C C C C C
charge: -0.046356 -0.309686 -0.256323 0.233694 -0.012580 0.027284 0.030182 0.032736 0.007919 -0.058669 -0.067433 0.049248 0.037930 0.199521 0.225392 -0.054338 -0.052755 0.051171 0.057532 -0.094468
polarizability: 2.82595663e+02 -1.37272302e+01 1.74041036e+02 1.35903112e+01 1.07644955e+01 1.46433807e+02
1716.lowfreq: -20.3218 -6.6080 -0.8151 0.0005 0.0011 0.0015 20.2334 23.9734 32.0294
frequency: 18.9442 22.7396 31.9362 64.9155 84.1743 94.4633 120.1310 155.3320 174.9588 190.2308 215.2534 224.0250 241.7881 271.7800 274.9223 278.4978 300.5416 331.8743 350.5199 370.6865 392.8992 410.6577 428.9487 474.6530 500.0516 503.7509 527.5102 567.7682 600.1202 622.7918 669.3093 690.6885 703.6274 726.4129 740.8397 759.4884 786.9358 798.6440 829.8082 838.7490 845.4584 847.6307 851.5951 906.9904 917.7829 948.0970 977.1005 986.0526 988.0375 989.9452 996.4684 999.7266 1028.5049 1051.1703 1059.8100 1069.7126 1075.8043 1092.7550 1105.5000 1107.1608 1138.3460 1143.4847 1171.6058 1175.7161 1196.5325 1206.1294 1228.2832 1243.0964 1269.4481 1269.8055 1279.7260 1288.5330 1295.6378 1303.0831 1313.1812 1331.3549 1337.4604 1345.4816 1357.2845 1366.1462 1371.1569 1377.0253 1393.4692 1395.4544 1454.5120 1460.8856 1463.7162 1470.1156 1471.4971 1474.6070 1477.4139 1496.9907 1575.9533 1597.8515 1613.4050 1666.8960 2964.2609 2967.7858 2978.2707 2984.6534 2990.6358 2991.9172 3003.9786 3007.8120 3021.1800 3029.7317 3041.8724 3045.2620 3048.5154 3056.7671 3065.4638 3081.2239 3094.5689 3156.2658 3163.9419 3176.4691 3185.0032
redmass: 5.0639 4.2010 4.8270 6.0584 4.3476 8.9942 4.7741 3.1015 3.8032 3.3292 3.0651 5.9355 2.6657 2.4576 4.0882 2.6063 6.8920 2.5687 4.2707 2.4398 2.3802 2.9085 3.1662 3.4543 3.9626 4.9748 1.8798 2.8686 3.1013 7.1031 4.7238 3.5663 1.9817 1.3713 3.7976 1.9167 2.0848 5.2476 2.0010 1.2635 3.0827 2.3536 1.5964 1.8944 2.4776 1.9484 1.3551 1.8905 1.3617 1.3182 2.3958 3.2702 2.3607 2.0658 4.0124 2.8009 2.4825 1.9860 1.7341 1.5438 1.8511 1.1706 1.3019 1.1572 1.3794 1.3206 1.3736 2.9885 1.2209 1.2895 1.1594 1.2490 1.1740 1.2916 1.2909 1.3169 1.3950 1.4139 1.3678 1.4303 1.3667 5.6510 1.4852 4.1226 1.0841 1.0799 1.0831 1.0953 2.4308 1.0870 1.1062 1.0899 8.6656 6.3347 10.6967 6.9221 1.0665 1.0599 1.0636 1.0629 1.0650 1.0640 1.0743 1.0748 1.0997 1.0971 1.0975 1.0961 1.0934 1.0911 1.0906 1.0954 1.0967 1.0890 1.0893 1.0969 1.0971
irintensity: 0.1110 0.1900 0.0058 0.4417 0.2896 1.7991 0.2429 0.5903 2.2832 0.4894 5.8753 1.0493 0.3000 1.2655 2.1762 0.4422 1.6879 0.9419 1.6988 0.7761 8.9177 0.0038 10.7524 10.3497 11.0457 13.9359 7.8812 1.4278 2.4374 1.3868 17.9256 6.8224 29.9780 37.6266 26.3369 9.9430 17.7537 12.6151 3.0680 2.4606 24.4232 7.9217 46.4866 2.5980 25.0505 9.4089 0.7097 13.8872 0.3610 0.0527 89.5446 48.7473 2.2791 44.3832 292.6244 52.1426 3.5984 3.2720 5.5789 4.1199 4.5856 4.9126 31.3121 30.6777 19.5484 5.2879 11.7407 391.7888 9.0768 18.2919 4.3798 0.6313 2.0475 3.1693 1.8888 1.2391 1.7331 2.5150 1.1306 1.0283 0.4920 5.9185 0.5952 15.5848 7.5457 4.2434 8.9708 7.8514 44.3771 14.8247 1.6456 36.6488 18.1003 91.0074 171.3884 1.4032 17.5933 33.0571 49.4300 57.2631 31.8294 25.2842 25.0022 12.4967 12.6907 17.8271 55.7030 2.4047 24.1249 48.2804 44.1754 34.6125 84.4915 0.0061 0.8921 3.7590 1.6739
temp: 298.150 k
press: 1.00000 atm
elementType: 17 8 8 6 6 6 6 6 6 6 6 6 6 6 6 6 6 6 6 6 1 1 1 1 1 1 1 1 1 1 1 1 1 1 1 1 1 1 1 1 1
symmnumber: 1
zpe: 893093.3 jmol-1
zpe.correction: 0.340161 hartree
zpe.thermalcorrener: 0.359279 hartree
zpe.thermalcorrenthalpy: 0.360223 hartree
zpe.thermalcorrgfe: 0.290773 hartree
zpe.sumelectzpe: -1269.404986 hartree
zpe.sumelectthermal: -1269.385869 hartree
zpe.sumelectthermalent: -1269.384924 hartree
zpe.sumelectthermalfe: -1269.454375 hartree
dipole: -2.2936 -1.0962 -0.4400
dipole: 2.5799
quadrupole: -126.6637 -130.4672 -124.8179
quadrupole: 1.0076 2.9447 1.1295
quadrupole: 0.6526 -3.1509 2.4983 1.0076 2.9447 1.1295
hfenergy: -1269.7451477 hartree
pointgroup: C01 [X(C17H21Cl1O2)]
dipole: 0.922185 0.293649 -0.3058755 debye
polarizability: 283.0465987|-16.1673721|157.1610194|3.5993828|-18.486537|162.8628871 unknown
InChI: InChI=1S/C17H21ClO2/c18-15-12-10-14(11-13-15)17(19)20-16-8-6-4-2-1-3-5-7-9-16/h1-2,10-13,16H,3-9H2
charge 0 multiplicity 1
41 atoms
Cl -6.666395 1.003479 -1.380323
O  -0.181292 -0.521492 -0.047231
O  -1.166786 -1.987696 1.4836
C  1.193714 -0.984843 0.373631
C  2.064979 -0.843465 -0.887728
C  1.619747 -0.208418 1.643311
C  3.507056 -1.386073 -0.690213
C  1.545013 1.340741 1.630009
C  4.57525 -0.679541 -1.561925
C  2.603696 2.111703 0.778884
C  4.712628 0.850862 -1.277066
C  4.035078 1.699953 1.063965
C  4.937299 1.169459 0.189746
C  -1.272621 -1.105867 0.592565
C  -2.57035 -0.566063 0.08612
C  -3.770488 -1.07372 0.647286
C  -2.631306 0.425953 -0.926589
C  -5.022751 -0.601004 0.206178
C  -3.877973 0.907645 -1.376962
C  -5.054022 0.384702 -0.801694
H  1.096518 -2.054052 0.64906
H  2.088896 0.215811 -1.190973
H  1.566139 -1.389674 -1.710841
H  2.650237 -0.521238 1.900128
H  0.975064 -0.57258 2.465965
H  3.525796 -2.473259 -0.901799
H  3.810751 -1.268109 0.36624
H  1.649728 1.672329 2.683144
H  0.535199 1.657918 1.304237
H  4.346012 -0.817061 -2.638125
H  5.553576 -1.169001 -1.381698
H  2.487037 3.189818 1.017803
H  2.372495 2.012796 -0.295087
H  3.818983 1.378891 -1.655232
H  5.568159 1.231754 -1.870141
H  4.360117 1.847656 2.107018
H  5.934533 0.910774 0.579912
H  -3.703864 -1.838703 1.427461
H  -1.702534 0.811215 -1.355191
H  -5.952404 -0.98727 0.63309
H  -3.936716 1.671473 -2.157238
