program: Gaussian 09
title: 000268176
version: EM64L-G09RevD.01
frameworkgroup: C1[X(C19H16N2O)]
method: RPBEPBE
basis: SDD
operation: Freq
keyword: #p
keyword: freq=noraman
keyword: PBEPBE/SDD
title: #p freq=noraman PBEPBE/SDD
converged: YES YES NO NO
title: Mulliken charges:
elementType: O N N C C C C C C C C C C C C C C C C C C C H H H H H H H H H H H H H H H H
charge: -0.237134 -0.393654 -0.019219 0.182870 -0.622844 0.473123 0.308530 -0.757662 0.039499 0.024820 0.329269 -0.408822 -0.396309 -0.251094 -0.228484 -0.380085 -0.392406 -0.239496 -0.229345 -0.227396 -0.241019 -0.232593 0.236629 0.259340 0.325762 0.226473 0.232757 0.234337 0.223442 0.261650 0.227802 0.233524 0.261518 0.238438 0.233533 0.237329 0.231054 0.235864
chargesum: 0.00000
title: Mulliken charges with hydrogens summed into heavy atoms:
elementType: O N N C C C C C C C C C C C C C C C C C C C
charge: -0.237134 -0.067892 -0.019219 0.182870 -0.126875 0.473123 0.308530 -0.064095 0.039499 0.024820 0.329269 -0.185381 -0.134660 -0.023293 0.005041 -0.118567 -0.153968 -0.005963 -0.229345 0.009933 -0.009965 0.003271
polarizability: 2.30384968e+02 -1.31043474e+01 2.42517903e+02 -1.73831242e+00 -1.67713431e+01 1.70645632e+02
1716.lowfreq: -6.9587 -2.9722 -0.0005 -0.0003 0.0004 0.6971 27.6970 34.3780 45.8737
frequency: 27.6416 34.3529 45.8344 58.7624 77.0924 86.2745 122.3902 148.1463 184.1254 217.8885 228.6108 239.4170 254.2417 278.3896 297.6675 304.4261 336.1941 371.1814 400.3968 403.1232 405.7357 423.5249 465.9584 501.1500 529.8564 549.8617 569.8490 587.2530 613.9835 616.5593 620.2663 627.9569 650.9937 681.6782 700.2123 709.3802 726.8836 757.9495 771.1274 774.2067 830.4714 851.0670 855.7149 912.7951 926.0221 935.0044 955.8903 967.5971 979.2167 980.9753 988.5663 989.3975 1000.8466 1001.4083 1024.6412 1028.4331 1065.1509 1074.9928 1084.4451 1096.3375 1104.3037 1147.2481 1165.7838 1175.1752 1177.3621 1194.0852 1199.6383 1210.2940 1264.3790 1279.0761 1315.2532 1318.1402 1327.5673 1360.1331 1377.5958 1379.3664 1385.1752 1403.3382 1433.4538 1434.0428 1444.0589 1469.2893 1472.6845 1481.8485 1483.5453 1572.5418 1585.8399 1591.8364 1606.0350 1610.4540 1613.1663 2178.0315 2968.7677 2986.0317 3076.1215 3082.2633 3096.2864 3109.5219 3127.0862 3130.8397 3136.3996 3141.7742 3148.2785 3155.4699 3159.7126 3168.5052 3172.1674 3523.0864
redmass: 5.2758 4.9836 4.5032 4.6791 10.1107 5.1464 4.6681 8.2025 4.1807 1.6568 1.9980 3.5227 5.0612 4.0696 2.8714 4.4254 4.0525 5.8645 4.2989 2.9726 3.1026 4.7092 4.9156 3.7910 3.7860 3.2472 2.7808 3.5482 5.3684 6.0949 2.4981 4.8041 4.5794 5.3576 1.7286 1.7428 3.9664 5.4768 2.0011 2.0668 4.4613 1.2626 1.2472 1.8573 1.3919 1.6286 1.9094 2.1154 1.4271 1.4185 5.4102 5.2210 1.3436 1.3241 2.6172 2.3097 2.9710 2.1973 1.9234 2.0534 2.1642 3.5321 1.7642 1.0548 1.0638 1.1188 1.1241 4.0633 2.2350 2.0953 1.5359 1.3807 2.2060 3.4186 7.0189 7.7845 1.3787 1.4356 2.1735 2.2907 1.1164 1.0708 1.1810 2.2328 1.7814 6.5165 6.5982 6.1662 6.0855 6.1018 6.7206 12.6336 1.0691 1.0361 1.0898 1.1003 1.0990 1.0874 1.0859 1.0865 1.0880 1.0919 1.0924 1.0945 1.0961 1.1005 1.1009 1.0766
irintensity: 0.2703 0.7484 0.6802 1.5488 0.6566 2.0539 0.1455 0.6303 1.5856 1.1137 0.0789 0.5821 1.3505 0.0475 4.8997 3.5454 0.7134 2.7210 1.1749 1.0404 0.7095 1.0208 3.6952 3.1648 19.1329 20.3254 27.0865 17.9668 7.2516 2.7879 41.3314 5.8568 12.9235 13.2976 41.1967 48.5295 12.2243 30.2174 38.7193 44.2448 0.4596 1.9144 0.5074 4.3565 3.0531 4.8783 1.9185 8.5343 0.6512 0.2209 1.0688 1.2133 0.0767 0.2534 12.5494 6.2682 3.9060 13.1921 3.2757 5.5740 4.7301 17.2906 9.9757 0.0131 0.5350 4.5177 3.1256 3.2570 49.9581 10.8727 3.2865 4.5574 50.7721 189.1193 23.2418 10.6640 29.6873 9.6271 11.3971 14.9969 20.3967 11.8376 0.7428 6.0901 18.8615 13.3245 44.9667 2.0067 90.1049 18.2289 195.2668 12.8878 12.5981 23.3219 4.7736 24.3943 25.5474 12.5100 2.9719 1.1744 1.7134 19.1849 17.5436 19.4878 23.0112 16.2157 15.9889 31.9138
temp: 298.150 k
press: 1.00000 atm
elementType: 8 7 7 6 6 6 6 6 6 6 6 6 6 6 6 6 6 6 6 6 6 6 1 1 1 1 1 1 1 1 1 1 1 1 1 1 1 1
symmnumber: 1
zpe: 782911.4 jmol-1
zpe.correction: 0.298195 hartree
zpe.thermalcorrener: 0.316940 hartree
zpe.thermalcorrenthalpy: 0.317884 hartree
zpe.thermalcorrgfe: 0.250387 hartree
zpe.sumelectzpe: -916.819748 hartree
zpe.sumelectthermal: -916.801003 hartree
zpe.sumelectthermalent: -916.800058 hartree
zpe.sumelectthermalfe: -916.867556 hartree
dipole: -1.7173 -6.8404 4.7985
dipole: 8.5303
quadrupole: -114.3969 -140.4853 -128.8963
quadrupole: -6.1323 4.7894 11.1765
quadrupole: 13.5293 -12.5592 -0.9702 -6.1323 4.7894 11.1765
hfenergy: -917.1179429 hartree
pointgroup: C01 [X(C19H16N2O1)]
dipole: 0.5658345 2.7315453 1.8659709 debye
polarizability: 230.5825268|-13.8258629|242.6387876|3.9270004|15.1287794|170.3271881 unknown
InChI: InChI=1S/C19H16N2O/c1-19(15-10-6-3-7-11-15)12-16(14-8-4-2-5-9-14)17(13-20)18(22)21-19/h2-11,21H,12H2,1H3
charge 0 multiplicity 1
38 atoms
O  0.920015 -3.649552 -0.131116
N  1.657895 -1.810001 1.081748
N  -1.854368 -2.657744 -2.114891
C  1.59999 -0.376222 1.450434
C  0.101844 -0.04228 1.696885
C  2.191438 0.536282 0.341476
C  -0.818047 -0.499506 0.573385
C  2.403616 -0.198904 2.76339
C  -0.478994 -1.656352 -0.106095
C  0.742879 -2.457545 0.26463
C  -2.052901 0.286366 0.321737
C  2.216211 1.944473 0.528827
C  2.724475 0.007056 -0.858209
C  2.757352 2.798768 -0.455596
C  3.267706 0.860705 -1.846508
C  -3.305319 -0.350781 0.091996
C  -2.005592 1.710585 0.31699
C  3.286458 2.258844 -1.651264
C  -1.243652 -2.197175 -1.195731
C  -4.469204 0.41142 -0.134209
C  -3.167752 2.470278 0.072539
C  -4.406386 1.824269 -0.148828
H  -0.017398 1.037813 1.877375
H  -0.224785 -0.551184 2.628598
H  2.498274 -2.346943 1.313622
H  2.356551 0.84454 3.117443
H  1.999766 -0.855964 3.554276
H  3.469381 -0.445462 2.604134
H  1.821055 2.386112 1.452819
H  2.715452 -1.073817 -1.029338
H  2.768315 3.882053 -0.290292
H  3.670253 0.429927 -2.76993
H  -3.372011 -1.442876 0.113336
H  -1.048389 2.226265 0.455346
H  3.705515 2.919477 -2.418058
H  -5.42423 -0.098107 -0.300298
H  -3.107265 3.563759 0.050713
H  -5.311151 2.414322 -0.331236
