program: Gaussian 09
title: 000268178
version: EM64L-G09RevD.01
frameworkgroup: C1[X(C17H21NO4)]
method: RPBEPBE
basis: SDD
operation: Freq
keyword: #p
keyword: freq=noraman
keyword: PBEPBE/SDD
title: #p freq=noraman PBEPBE/SDD
converged: YES YES NO NO
title: Mulliken charges:
elementType: O O O O N C C C C C C C C C C C C C C C C C H H H H H H H H H H H H H H H H H H H H H
charge: -0.304417 -0.245489 -0.201068 -0.202483 0.027449 -0.008245 -0.444358 -0.423590 -0.385855 -0.379092 -0.397869 -0.464439 -0.475324 -0.159268 -0.172452 0.202867 0.230325 -0.320101 -0.314479 -0.353275 -0.345445 0.387271 0.241541 0.211940 0.221923 0.219734 0.235407 0.206882 0.209880 0.195268 0.216760 0.206680 0.201788 0.206996 0.200869 0.202719 0.206189 0.208880 0.212353 0.282623 0.281078 0.290848 0.288974
chargesum: 0.00000
title: Mulliken charges with hydrogens summed into heavy atoms:
elementType: O O O O N C C C C C C C C C C C C C C C C C
charge: -0.304417 -0.245489 -0.201068 -0.202483 0.027449 0.233297 -0.010494 0.031551 0.030908 0.032937 0.010599 -0.056574 -0.066416 0.049612 0.039901 0.202867 0.230325 -0.037477 -0.033401 -0.062428 -0.056470 0.387271
polarizability: 2.96601816e+02 -6.70203823e+00 1.90750073e+02 1.68273624e+01 9.73611927e+00 1.46631746e+02
1716.lowfreq: -8.3983 -0.0004 0.0003 0.0007 2.1068 3.9837 19.6967 27.1921 32.9320
frequency: 19.5981 26.9869 32.8204 54.5904 69.5501 85.5734 91.1862 123.3381 157.3935 173.9448 190.5527 208.9739 215.9636 235.3518 263.5856 267.7898 278.5244 294.4158 330.4177 345.4315 379.2521 393.6880 410.3048 428.4016 458.9074 485.2419 498.8167 519.8652 531.8685 566.2599 603.2825 623.8123 653.1450 677.3496 685.8018 703.5366 729.7117 756.4578 765.1231 775.1889 788.9832 808.1035 831.9592 841.5207 848.2961 863.2295 888.2711 909.1798 915.8653 948.7547 985.5142 993.3904 997.5705 1003.4640 1005.4831 1011.2073 1029.7329 1052.7445 1065.1679 1078.4530 1089.6879 1094.1152 1106.8120 1108.6283 1140.7466 1144.1760 1172.3889 1174.6815 1195.7495 1205.1237 1214.2053 1229.6808 1245.1433 1269.8605 1271.3252 1280.2766 1291.3829 1298.5727 1303.7058 1312.1487 1329.9036 1339.0803 1345.8352 1356.9681 1367.4179 1367.5805 1372.0867 1394.5414 1405.2176 1414.6453 1458.7296 1460.4948 1463.9362 1468.9239 1473.8868 1475.1228 1479.5897 1501.8385 1587.4272 1608.8179 1615.7185 1667.3069 2964.4495 2968.4967 2978.9166 2984.8713 2991.7872 2993.1305 3003.6173 3007.6794 3021.1685 3028.2753 3041.3195 3045.3316 3048.9518 3055.8471 3065.3160 3079.4725 3094.8115 3164.2176 3175.1328 3187.2210 3192.8040
redmass: 5.0202 5.3282 5.1932 8.6930 5.6807 5.9619 5.5897 4.9449 3.3021 3.6801 3.4906 4.8255 3.8844 2.6593 3.9067 3.0069 3.2260 3.0123 2.7791 3.7874 2.6284 2.3616 2.8868 2.9984 4.0886 8.0127 3.8147 3.8795 2.0633 2.8734 3.0764 7.0925 6.0570 7.0675 3.8945 1.6392 1.3633 2.1752 5.1129 5.2088 2.0490 4.8754 2.2743 3.0638 2.3491 1.2460 1.6743 1.8866 2.4446 1.9292 1.9784 1.2792 1.9871 1.3476 3.2406 1.3688 2.3364 1.9653 4.0851 2.6150 3.2226 1.8971 1.4609 1.8180 1.7678 1.2323 1.3048 1.2641 1.3767 1.3508 6.3357 1.3717 3.5524 1.2013 1.2951 1.1618 1.2610 1.1650 1.2963 1.2971 1.3132 1.3946 1.4023 1.3670 1.8511 3.5191 1.3689 1.4814 8.1390 4.5999 1.0755 1.0827 1.0829 1.0989 2.3742 1.0986 1.1031 1.0894 9.3639 6.5423 9.7446 6.9236 1.0661 1.0599 1.0633 1.0626 1.0659 1.0634 1.0712 1.0767 1.1000 1.0974 1.0962 1.0992 1.0939 1.0905 1.0909 1.0961 1.0967 1.0901 1.0889 1.0958 1.0973
irintensity: 0.0933 0.0758 0.0977 0.2428 0.0463 2.3420 3.0291 0.4666 2.0638 2.2462 0.3032 5.0549 2.9176 0.9923 0.6593 0.3785 1.7135 3.7229 0.6487 0.1832 0.8331 9.0184 0.0049 5.2920 0.8066 6.0620 1.9218 3.8415 6.9844 1.1050 2.1417 0.3964 0.1789 2.7614 51.4428 25.2532 44.3062 16.1805 4.5865 17.9613 25.9242 3.5526 7.2619 43.6959 8.0308 0.6291 52.2273 3.0695 28.2663 9.4540 8.5604 0.1729 28.1106 0.9067 33.6326 0.0355 1.9776 18.3214 331.1098 1.9590 11.6032 3.0383 11.6234 1.8906 3.8401 5.0354 11.5139 4.3424 27.6970 32.8604 512.1049 1.0101 198.7802 5.3997 13.4328 3.7355 0.8222 1.8648 1.8237 1.8681 0.8278 0.9663 1.8504 1.2927 15.9798 69.9728 0.4346 0.6663 10.5321 62.2235 6.4430 7.5648 8.7410 10.6453 5.4604 14.5533 3.7885 34.1273 65.8402 7.6578 91.6077 1.3085 16.9003 33.2333 51.5485 56.0506 20.4625 26.7077 22.8106 13.5570 12.0244 22.5193 41.0278 17.4938 20.8920 44.6752 47.7237 32.8769 81.2259 1.3662 1.0770 0.3491 0.5629
temp: 298.150 k
press: 1.00000 atm
elementType: 8 8 8 8 7 6 6 6 6 6 6 6 6 6 6 6 6 6 6 6 6 6 1 1 1 1 1 1 1 1 1 1 1 1 1 1 1 1 1 1 1 1 1
symmnumber: 1
zpe: 922172.4 jmol-1
zpe.correction: 0.351237 hartree
zpe.thermalcorrener: 0.371645 hartree
zpe.thermalcorrenthalpy: 0.372589 hartree
zpe.thermalcorrgfe: 0.300323 hartree
zpe.sumelectzpe: -1014.315349 hartree
zpe.sumelectthermal: -1014.294941 hartree
zpe.sumelectthermalent: -1014.293997 hartree
zpe.sumelectthermalfe: -1014.366264 hartree
dipole: -5.7758 0.1491 -0.3579
dipole: 5.7888
quadrupole: -160.0379 -137.1910 -126.9589
quadrupole: 9.7402 2.3669 1.7331
quadrupole: -18.6420 4.2049 14.4371 9.7402 2.3669 1.7331
hfenergy: -1014.6665861 hartree
pointgroup: C01 [X(C17H21N1O4)]
dipole: 2.2774058 -0.0070436 0.0189997 debye
polarizability: 298.373453|-6.6965908|169.7483934|-3.4625022|-24.8978073|165.861789 unknown
InChI: InChI=1S/C17H21NO4/c19-17(14-10-12-15(13-11-14)18(20)21)22-16-8-6-4-2-1-3-5-7-9-16/h1-2,10-13,16H,3-9H2
charge 0 multiplicity 1
43 atoms
O  0.435028 -0.592719 -0.061794
O  -0.387502 -2.346391 1.246125
O  -6.880303 -0.081721 -0.319718
O  -5.984199 1.555242 -1.631214
N  -5.876829 0.544251 -0.835991
C  1.85994 -1.02797 0.215529
C  2.655186 -0.584947 -1.024904
C  2.297448 -0.48188 1.595551
C  4.132017 -1.065508 -0.996637
C  2.139721 1.033406 1.886841
C  5.115258 -0.136013 -1.750792
C  3.113736 2.018799 1.165728
C  5.186985 1.313931 -1.173205
C  4.576977 1.648331 1.312575
C  5.463001 1.353812 0.3187
C  -0.580782 -1.343425 0.513418
C  -1.937888 -0.821078 0.145896
C  -3.071695 -1.482135 0.685442
C  -2.105258 0.293421 -0.716648
C  -4.368792 -1.03949 0.369627
C  -3.39742 0.74587 -1.043159
C  -4.508925 0.070223 -0.493022
H  1.839953 -2.134335 0.28042
H  2.605557 0.512739 -1.109037
H  2.146117 -0.988112 -1.921016
H  3.354583 -0.773328 1.748305
H  1.715083 -1.037331 2.355132
H  4.196706 -2.08593 -1.422688
H  4.48285 -1.141396 0.049067
H  2.278176 1.16006 2.979814
H  1.099596 1.346811 1.670122
H  4.839108 -0.073038 -2.822819
H  6.125408 -0.590997 -1.711091
H  2.950492 3.020372 1.616226
H  2.83918 2.117219 0.102113
H  4.251774 1.852863 -1.409262
H  5.994039 1.852976 -1.708622
H  4.943462 1.611586 2.351599
H  6.490166 1.086875 0.613811
H  -2.911664 -2.339359 1.346561
H  -1.220816 0.789483 -1.123606
H  -5.260952 -1.527632 0.769597
H  -3.561219 1.59887 -1.706378
