program: Gaussian 09
title: 000268139
version: EM64L-G09RevD.01
frameworkgroup: C1[X(C8H15NO)]
method: RPBEPBE
basis: SDD
operation: Freq
keyword: #p
keyword: freq=noraman
keyword: PBEPBE/SDD
title: #p freq=noraman PBEPBE/SDD
converged: YES YES NO NO
title: Mulliken charges:
elementType: O N C C C C C C C C H H H H H H H H H H H H H H H
charge: -0.457049 -0.135146 -0.203226 -0.110059 -0.483438 -0.476662 -0.105661 -0.462861 -0.421157 -0.637716 0.257777 0.230177 0.234000 0.219703 0.217273 0.233241 0.227037 0.224556 0.204473 0.196201 0.232566 0.202505 0.229379 0.233054 0.351034
chargesum: 0.00000
title: Mulliken charges with hydrogens summed into heavy atoms:
elementType: O N C C C C C C C C
charge: -0.106015 -0.135146 0.054551 0.120118 -0.029735 -0.026148 0.121376 -0.033832 0.007610 0.027222
polarizability: 9.32976458e+01 -1.36300118e+00 8.86910068e+01 7.62317717e-01 -6.29530697e-01 8.55734153e+01
1716.lowfreq: -33.6528 -25.7473 -12.7215 0.0004 0.0005 0.0007 140.2278 155.6839 187.2126
frequency: 140.1846 155.6421 187.2103 198.9705 251.4330 300.7786 359.6672 370.0200 400.8892 470.8718 518.5784 644.2083 650.9650 694.3136 738.5553 753.3990 766.9880 806.7393 834.4257 883.6611 912.3182 944.0336 961.9478 968.9607 993.8338 1007.4949 1029.4568 1072.4693 1105.6000 1111.4193 1125.0340 1137.8613 1147.7748 1171.6291 1208.8884 1214.0364 1219.6820 1238.9395 1258.0918 1282.5891 1295.5243 1299.0843 1316.1605 1333.4949 1339.7539 1355.6297 1378.8281 1429.3363 1451.6619 1459.7251 1467.0602 1468.1936 1483.3399 1490.4477 2904.3845 2982.9553 2991.9564 3003.4391 3015.6213 3030.7160 3035.7412 3038.4628 3047.0423 3052.9011 3058.3866 3061.4049 3080.8913 3083.5198 3331.1854
redmass: 3.9931 2.9455 1.7855 1.1539 2.4532 2.5181 2.6816 2.0879 2.8648 3.5844 3.1154 1.2563 2.3207 3.2318 3.7237 3.0169 1.7576 2.2118 2.0268 2.5869 2.5031 2.3041 2.3979 2.5832 2.0402 2.3085 1.9896 1.7650 1.5811 1.1904 1.8892 2.4376 1.2397 1.1980 1.4627 1.6009 1.3768 1.4239 1.4837 1.3733 1.4094 1.4608 1.5363 1.5120 1.4584 1.4012 1.2437 1.1669 1.0828 1.0893 1.0543 1.0729 1.0509 1.0884 1.0507 1.0635 1.0626 1.0595 1.0639 1.0795 1.0871 1.0859 1.0977 1.0953 1.0983 1.1000 1.1044 1.1008 1.0637
irintensity: 5.0216 0.9413 0.6784 0.0227 2.7779 1.3907 3.5511 0.7040 0.0967 2.2250 4.4547 74.2719 22.0983 28.9805 3.7182 2.4325 1.7017 2.1939 10.5250 7.0997 13.5434 10.1486 10.1696 53.0097 10.0605 7.2735 12.5493 8.5265 6.0489 6.5759 25.9153 9.6114 26.7294 12.1654 15.1717 10.7666 7.5053 6.1115 7.4623 2.0132 0.5537 0.6153 0.4328 5.0303 4.1046 2.4922 80.4983 5.6077 8.2560 9.3075 10.8762 14.2107 2.3326 30.5776 92.6643 25.7566 36.0603 18.1555 44.2761 41.6913 10.0348 99.1518 32.3531 12.8437 9.6951 49.7918 57.8220 30.9430 55.0775
temp: 298.150 k
press: 1.00000 atm
elementType: 8 7 6 6 6 6 6 6 6 6 1 1 1 1 1 1 1 1 1 1 1 1 1 1 1
symmnumber: 1
zpe: 583337.5 jmol-1
zpe.correction: 0.222182 hartree
zpe.thermalcorrener: 0.231324 hartree
zpe.thermalcorrenthalpy: 0.232268 hartree
zpe.thermalcorrgfe: 0.188916 hartree
zpe.sumelectzpe: -442.995916 hartree
zpe.sumelectthermal: -442.986774 hartree
zpe.sumelectthermalent: -442.985830 hartree
zpe.sumelectthermalfe: -443.029182 hartree
dipole: -3.0573 -1.8318 0.3236
dipole: 3.5787
quadrupole: -66.0392 -63.5334 -59.6018
quadrupole: -6.6060 1.1610 0.1345
quadrupole: -2.9810 -0.4753 3.4563 -6.6060 1.1610 0.1345
hfenergy: -443.2180978 hartree
pointgroup: C01 [X(C8H15N1O1)]
dipole: -1.2574645 -0.5639593 0.2882706 debye
dipolederiv: -0.6036173 -0.1034293 0.1900309 -0.0230521 -0.6905314 0.0708855 0.1371006 0.1087655 -0.5112521 -0.6256 0.0010394 0.0573576 0.0689429 -0.5327697 0.087859 0.0039493 0.1503382 -0.5034237 0.1874507 0.0520886 0.0745941 0.090235 0.1452181 0.00093 0.0158421 -0.0538628 0.3030348 0.2016918 0.0235518 -0.0907352 0.0389804 0.393487 -0.0129145 -0.0401315 0.0100471 0.2768893 -0.0021715 -0.1351689 0.0512097 -0.1112872 -0.0175676 0.0640506 -0.002208 0.0336215 -0.0247097 0.0672119 -0.0410029 0.0643635 -0.0394422 -0.0060846 -0.0132993 0.0864542 0.0415669 -0.1268259 0.3107521 0.0814276 -0.0374722 0.0115686 0.4844245 -0.0387161 -0.0405165 -0.0781611 0.3678912 0.0164435 0.0229992 -0.033859 0.0449415 0.0697658 0.0015629 -0.0092586 0.0066966 0.0649843 0.0333864 0.03457 -0.0121269 -0.0203408 -0.081754 -0.0560643 -0.0036085 -0.098651 0.0628357 0.3832614 -0.1252429 -0.0130439 -0.1470832 0.2268768 -0.0994916 -0.0068543 -0.1000217 0.1953304 0.0414242 0.028552 0.0120753 0.004483 -0.1524485 -0.0815219 -0.0041056 -0.0418897 0.0281695 -0.0697855 -0.030324 -0.1188008 -0.0010391 0.0416592 -0.0068511 -0.1050655 -0.0387481 -0.0993893 -0.0823561 0.0623819 0.1240596 0.070634 0.0079051 -0.0938988 0.0689307 -0.0521786 -0.0010568 0.0133267 0.049818 -0.1293834 0.0488635 0.0206116 0.0945099 -0.0917636 0.0453415 -0.0481849 0.0780087 0.0760296 -0.0309637 0.0205415 -0.1549467 0.0301909 -0.0139375 0.0544498 0.0577722 -0.1887059 -0.0357841 0.013543 0.0283635 0.0730525 -0.0198746 -0.001095 -0.0249791 0.0498418 -0.020768 -0.017658 -0.105007 -0.0299255 0.0130314 -0.0367016 -0.0987907 -0.0161722 -0.1202438 0.0059333 -0.0063191 0.072031 -0.034751 0.0649399 0.1075142 0.052634 0.0430301 -0.1149798 0.0402072 -0.0301718 -0.0232938 -0.0031258 -0.1979198 -0.0792267 -0.0139104 -0.0334048 0.0640343 0.0813262 -0.0725735 0.0396438 -0.0433408 -0.0508085 0.1064733 0.0022587 0.1081106 -0.1129107 -0.1577579 0.0742193 0.032442 0.0480191 0.0595395 -0.0194232 0.060385 -0.036804 0.0561684 -0.2012875 0.0526392 0.0771956 -0.0417717 0.0312369 0.0689402 0.1814173 0.0197918 -0.0355083 0.0177458 0.0336293 -0.0755491 -0.0184927 0.0988905 -0.0460647 -0.1129258 0.0150523 -0.1301119 0.0620297 -0.0591085 -0.009046 0.0080761 -0.1547142 -0.0117888 0.012347 -0.0634603 0.0984872 0.4118503 0.063837 -0.1292652 0.0300031 0.3089063 -0.017079 -0.0771474 0.0015213 0.203158 unknown
polarizability: 93.0547058|-1.6956988|88.6506918|0.6899279|-1.1897839|85.8566703 unknown
InChI: InChI=1S/C8H15NO/c1-9-6-2-4-7(9)8(10)5-3-6/h6-8,10H,2-5H2,1H3
charge 0 multiplicity 1
25 atoms
O  2.049037 1.267442 -0.456864
N  -0.621139 0.715684 -0.618114
C  -0.01194 0.779726 0.756219
C  -0.829426 -0.768166 -0.782541
C  -0.830264 -0.226012 1.630634
C  -1.409553 -1.248607 0.595728
C  1.471255 0.358459 0.543025
C  0.552678 -1.402361 -1.079097
C  1.554827 -1.116467 0.07237
C  -1.85347 1.523912 -0.775439
H  -0.041879 1.816848 1.132286
H  -1.523511 -0.953378 -1.621732
H  -1.639594 0.299274 2.167981
H  -0.194148 -0.711834 2.392164
H  -1.110159 -2.287973 0.817098
H  -2.513729 -1.219776 0.587388
H  2.059934 0.509628 1.465311
H  0.93593 -0.97559 -2.024977
H  0.44323 -2.493397 -1.230091
H  1.347042 -1.786647 0.930426
H  2.589374 -1.323599 -0.254697
H  -2.675239 1.244935 -0.075645
H  -2.230764 1.414564 -1.807667
H  -1.611437 2.588817 -0.612495
H  1.300143 1.383117 -1.116873
