program: Gaussian 09
title: 000268149
version: EM64L-G09RevD.01
frameworkgroup: C1[X(C16H16O4)]
method: RPBEPBE
basis: SDD
operation: Freq
keyword: #pfreq=noraman
keyword: PBEPBE/SDD
title: #p freq=noraman PBEPBE/SDD
converged: YES YES NO NO
title: Mulliken charges:
elementType: O O O O C C C C C C C C C C C C C C C C H H H H H H H H H H H H H H H H
charge: -0.279337 -0.243516 -0.430122 -0.238907 -0.194370 -0.177121 -0.510608 -0.452039 -0.454987 -0.072631 -0.194337 -0.235394 0.176639 0.186926 0.179820 -0.367456 -0.324350 -0.219704 -0.218564 0.101717 0.249664 0.227723 0.241470 0.212317 0.218304 0.244948 0.219621 0.220886 0.259212 0.222676 0.246465 0.271034 0.271710 0.240028 0.239132 0.383153
chargesum: 0.00000
title: Mulliken charges with hydrogens summed into heavy atoms:
elementType: O O O O C C C C C C C C C C C C C C C C
charge: -0.279337 -0.243516 -0.046969 -0.238907 0.055294 0.050602 -0.056822 0.011213 -0.014480 0.186581 0.028339 0.011071 0.176639 0.186926 0.179820 -0.096422 -0.052640 0.020324 0.020568 0.101717
polarizability: 2.28928289e+02 1.86930979e+01 1.79946565e+02 -1.90495425e+01 4.94596063e+00 1.30227382e+02
1716.lowfreq: -5.6606 -0.0007 -0.0003 0.0004 6.0518 7.9316 14.4962 34.4176 36.6926
frequency: 14.4343 34.3598 36.6477 48.3505 79.3432 109.9274 128.4809 147.2489 172.3392 225.7296 229.8027 260.8531 280.4755 332.2959 359.1145 382.8682 390.3365 405.8563 435.3862 448.4377 517.8116 537.0191 593.4278 596.6697 603.2638 621.4357 649.6319 674.9406 693.8387 706.7833 740.1070 749.4034 781.9165 789.2746 791.2664 802.0823 819.8112 850.3313 872.3202 887.9062 898.6136 905.9761 943.4871 955.4925 977.2332 982.4137 985.2819 998.6328 1003.8934 1005.6151 1032.0473 1036.1475 1061.1702 1071.4417 1094.2013 1110.8581 1144.9231 1160.9691 1162.4748 1168.9370 1178.2730 1190.3893 1200.3259 1223.6206 1238.9335 1278.3156 1285.0842 1296.4616 1303.6979 1307.3079 1311.2427 1321.1732 1331.5522 1347.9940 1378.3643 1382.1877 1429.2684 1462.8393 1471.1698 1477.5580 1485.7379 1578.0244 1602.3421 1611.3295 1647.3086 1654.1392 2991.9534 2998.0110 3000.6319 3015.9798 3037.5153 3050.0940 3058.2634 3066.1302 3086.1720 3111.8079 3139.3733 3146.7781 3154.4928 3168.3929 3180.4286 3523.1679
redmass: 4.7702 6.1873 6.6202 4.6126 5.1827 4.5481 4.2979 6.3690 3.2849 4.8228 4.8684 4.1299 3.9674 4.9930 5.3610 6.4887 1.9769 3.2161 4.6380 3.8183 4.2461 5.0981 3.6291 1.5338 3.6134 3.6979 5.9773 4.8764 2.3790 3.7092 3.4643 2.9133 2.2356 1.8453 1.8493 4.1342 3.1252 3.5295 3.1852 3.8328 2.2204 1.5501 2.2263 2.1544 1.4268 1.7819 1.3208 4.2298 2.1754 1.5837 3.3305 2.2209 1.5137 3.2479 1.4643 1.8438 1.3636 1.1880 1.7602 1.1103 1.0636 1.2539 1.5858 1.2515 2.7238 1.5422 1.3249 1.5242 1.4871 1.4371 2.5075 1.5850 1.5901 1.4283 1.6727 10.4553 2.2078 1.0835 1.0870 2.6600 1.0952 7.3785 6.5840 10.6124 9.0105 6.9139 1.0623 1.0612 1.0833 1.0649 1.0858 1.0875 1.1012 1.1043 1.1027 1.0867 1.0864 1.0992 1.0911 1.0962 1.0982 1.0641
irintensity: 0.0603 1.6346 0.8463 0.5021 1.3907 1.5317 0.4539 2.6628 1.8580 3.5861 0.4329 3.3055 0.5591 4.8432 3.0806 11.7084 0.1611 2.0219 2.8569 2.2080 1.3483 19.9754 41.2790 62.4539 21.7654 6.2766 13.7632 2.1750 10.8711 114.8696 13.8011 7.2972 12.5121 33.5491 16.0876 7.0717 1.4171 17.4068 4.6317 101.5159 2.6424 4.9122 13.9015 2.9210 14.1463 0.9853 2.9577 174.4931 64.0682 20.6489 91.8545 6.0585 6.3532 193.4016 7.6115 61.7867 0.5409 12.8595 66.7484 3.4288 0.1158 12.0301 2.3528 0.2607 247.4535 55.3415 0.4363 5.7352 16.5697 5.8580 65.4777 0.6910 1.5444 3.8011 10.8305 9.7859 8.1717 6.3137 10.2367 18.9751 4.6777 40.7313 51.9225 120.3422 235.8017 5.1757 35.0563 35.9385 11.6670 44.4204 78.5574 27.9402 6.7835 26.2451 42.8931 14.6138 2.4651 18.4218 8.7156 9.9488 12.4283 35.9206
temp: 298.150 k
press: 1.00000 atm
elementType: 8 8 8 8 6 6 6 6 6 6 6 6 6 6 6 6 6 6 6 6 1 1 1 1 1 1 1 1 1 1 1 1 1 1 1 1
symmnumber: 1
zpe: 749012.9 jmol-1
zpe.correction: 0.285284 hartree
zpe.thermalcorrener: 0.302409 hartree
zpe.thermalcorrenthalpy: 0.303353 hartree
zpe.thermalcorrgfe: 0.238017 hartree
zpe.sumelectzpe: -918.744666 hartree
zpe.sumelectthermal: -918.727541 hartree
zpe.sumelectthermalent: -918.726597 hartree
zpe.sumelectthermalfe: -918.791932 hartree
dipole: -0.5610 0.7505 2.8934
dipole: 3.0414
quadrupole: -93.4111 -105.5168 -125.2500
quadrupole: 1.5959 -4.4656 -3.2302
quadrupole: 14.6482 2.5425 -17.1907 1.5959 -4.4656 -3.2302
hfenergy: -919.0299497 hartree
pointgroup: C01 [X(C16H16O4)]
dipole: 0.1408811 -0.6292842 -1.0079258 debye
polarizability: 221.1319133|-35.6906198|157.4049726|-3.2227527|-24.457767|160.5653495 unknown
InChI: InChI=1S/C16H16O4/c17-15(18)12-3-1-2-4-13(12)16(19)20-14-8-6-10-5-7-11(14)9-10/h1-4,6,8,10-11,14,17H,5,7,9H2
charge 0 multiplicity 1
36 atoms
O  -0.355174 0.032948 0.297338
O  0.332465 -0.149907 2.524454
O  2.243063 1.252913 -2.448297
O  1.372247 2.134116 -0.487668
C  -2.719109 -0.566063 0.884565
C  -4.353326 0.479834 -0.508795
C  -4.129923 0.08434 0.976924
C  -2.821713 -1.452579 -0.400386
C  -4.003845 -0.8568 -1.242876
C  -1.697166 0.585893 0.732287
C  -3.338956 1.55544 -0.888906
C  -2.102278 1.590355 -0.323464
C  0.578821 -0.201941 1.294027
C  1.900557 -0.625909 0.717699
C  2.484292 -0.059538 -0.454058
C  2.556594 -1.695279 1.373013
C  3.680067 -0.617257 -0.974337
C  3.756274 -2.231378 0.858528
C  4.310368 -1.701378 -0.328511
C  1.953106 1.192762 -1.073582
H  -2.459131 -1.160213 1.777751
H  -5.383085 0.816808 -0.722607
H  -4.172761 0.948215 1.664368
H  -4.877805 -0.661718 1.305905
H  -3.02858 -2.501688 -0.12215
H  -1.869996 -1.443726 -0.957037
H  -3.723956 -0.692126 -2.29808
H  -4.881247 -1.531102 -1.228975
H  -1.518273 1.070941 1.7124
H  -3.620657 2.298622 -1.646289
H  -1.358522 2.35309 -0.583346
H  2.10577 -2.101738 2.283807
H  4.114064 -0.179915 -1.877507
H  4.249265 -3.060973 1.376054
H  5.234731 -2.118826 -0.741148
H  1.911418 2.121674 -2.802703
