program: Gaussian 09
title: 000268154
version: EM64L-G09RevD.01
frameworkgroup: C1[X(C16H19NO4)]
method: RPBEPBE
basis: SDD
operation: Freq
keyword: #p
keyword: freq=noraman
keyword: PBEPBE/SDD
title: #p freq=noraman PBEPBE/SDD
converged: YES YES NO NO
title: Mulliken charges:
elementType: O O O O N C C C C C C C C C C C C C C C C H H H H H H H H H H H H H H H H H H H
charge: -0.303509 -0.247296 -0.201474 -0.202827 0.027357 -0.101099 -0.033472 -0.522000 -0.020841 -0.528546 -0.464773 -0.392396 -0.449915 -0.416049 0.207915 0.224701 -0.319446 -0.317039 -0.355129 -0.346604 0.387092 0.221037 0.206116 0.220085 0.221078 0.245862 0.215335 0.215541 0.196919 0.208522 0.210390 0.211045 0.233093 0.209056 0.207465 0.210705 0.282402 0.281257 0.290671 0.288770
chargesum: 0.00000
title: Mulliken charges with hydrogens summed into heavy atoms:
elementType: O O O O N C C C C C C C C C C C C C C C C
charge: -0.303509 -0.247296 -0.201474 -0.202827 0.027357 0.119938 0.172644 -0.080837 0.225021 -0.097670 -0.059331 0.029040 -0.007766 0.002120 0.207915 0.224701 -0.037045 -0.035782 -0.064458 -0.057834 0.387092
polarizability: 2.83912032e+02 -8.51442898e+00 1.73460474e+02 3.16406005e+00 2.32114740e+01 1.37981280e+02
1716.lowfreq: -5.1316 -0.0009 -0.0007 -0.0006 5.5045 7.9927 21.2566 26.6043 44.7600
frequency: 21.1517 26.4289 44.7039 53.8789 63.4249 71.4650 87.8988 107.4270 159.3698 169.5489 182.1372 226.1406 243.5236 274.1785 284.6693 316.3017 356.0705 383.0962 410.9196 424.2520 445.2944 462.0574 481.3642 495.3078 511.4289 540.6219 576.5325 617.5057 623.7801 652.6240 682.8320 685.8444 759.0739 765.0188 768.5829 799.5770 824.0527 842.5976 858.2735 865.3107 871.3307 889.5167 893.7135 901.8030 919.4957 946.6517 971.7971 1005.0469 1005.5351 1012.7885 1017.0962 1029.3130 1056.9454 1070.8253 1077.3892 1088.8799 1090.1220 1107.9157 1116.0725 1127.6173 1147.0046 1174.6064 1178.0096 1182.7616 1206.6720 1215.0193 1230.0668 1241.9800 1245.4829 1257.5524 1270.0711 1284.1174 1291.6187 1292.3028 1298.0515 1302.5958 1311.3091 1329.2660 1331.5921 1344.3917 1350.7875 1366.8798 1370.5264 1405.4421 1414.2476 1463.5617 1467.4097 1467.7701 1472.3513 1474.1713 1474.1884 1487.5532 1587.1004 1609.1410 1615.8324 2931.7156 2958.7266 2968.9519 2975.6164 2984.5459 2988.1078 2988.7626 3011.4959 3014.6758 3031.0451 3042.9759 3045.9008 3061.2716 3061.5859 3079.4954 3164.5697 3175.6762 3187.7899 3193.4068
redmass: 4.6826 5.7159 5.0069 6.7154 1.8355 5.3052 8.0368 3.9280 2.3702 6.6570 3.7985 6.7820 3.5304 5.5280 5.3490 1.9881 5.7843 4.1042 2.8960 2.9594 3.8807 4.0844 4.8352 3.4946 5.3239 3.4731 2.7133 2.9303 7.0390 6.2792 7.5739 3.9884 1.1838 5.1180 6.8856 4.1196 2.5424 2.6256 1.5780 1.2444 2.2494 1.6659 3.7724 2.7253 1.7104 2.0758 1.6241 3.2970 1.3481 1.3659 2.6011 1.4462 2.3209 2.5567 2.6425 2.4653 3.1839 1.3313 1.9560 1.7107 1.9113 1.2265 1.5817 1.5148 1.5444 5.5221 1.1695 1.4415 2.9962 1.3525 1.3694 1.2908 1.2637 1.3248 1.2955 1.2848 1.2954 1.4020 1.3962 1.4323 1.6315 7.8882 1.8178 8.5119 4.4630 1.0875 1.0822 1.0847 1.0936 1.1023 2.3561 1.0989 9.3617 6.6061 9.6961 1.0810 1.0815 1.0632 1.0642 1.0621 1.0635 1.0641 1.0642 1.0839 1.0984 1.0992 1.1003 1.1001 1.1021 1.1036 1.0901 1.0890 1.0958 1.0973
irintensity: 0.0199 0.0815 0.0422 0.2463 0.0182 0.0333 5.1773 0.8134 0.3492 1.2563 4.6216 4.5140 2.2873 0.4509 4.4426 1.2504 2.1882 1.8358 0.0030 2.7693 0.3914 0.6454 10.5659 2.4156 2.1545 0.1825 1.0917 1.4291 0.6087 0.0241 5.2990 54.6733 6.4328 3.6959 28.0618 10.0159 4.3208 15.1130 14.3944 0.6478 7.4552 54.2660 61.2022 1.0512 0.0544 14.6732 8.5622 46.9405 1.1202 0.0712 2.0268 11.4208 184.5775 158.8899 12.5922 7.0370 12.9487 12.1131 5.1496 0.8660 2.3052 3.5284 1.6816 0.5697 77.4415 490.8597 3.4668 19.5988 173.8276 0.2441 9.5550 5.9318 0.2020 1.6735 0.4076 12.9348 2.9374 0.8077 0.2528 0.8227 0.5272 85.0491 2.4322 8.2896 64.0667 5.3935 7.9141 1.8872 7.2211 18.1244 2.2304 4.6533 67.0264 11.1979 92.5686 7.6627 7.2044 32.9511 30.8578 30.7782 18.3187 66.8899 49.5141 23.0842 46.5331 42.3898 33.1490 13.5289 32.1530 86.6865 1.3307 1.0532 0.3329 0.5019
temp: 298.150 k
press: 1.00000 atm
elementType: 8 8 8 8 7 6 6 6 6 6 6 6 6 6 6 6 6 6 6 6 6 1 1 1 1 1 1 1 1 1 1 1 1 1 1 1 1 1 1 1
symmnumber: 1
zpe: 851692.5 jmol-1
zpe.correction: 0.324393 hartree
zpe.thermalcorrener: 0.343116 hartree
zpe.thermalcorrenthalpy: 0.344060 hartree
zpe.thermalcorrgfe: 0.274809 hartree
zpe.sumelectzpe: -975.127478 hartree
zpe.sumelectthermal: -975.108755 hartree
zpe.sumelectthermalent: -975.107811 hartree
zpe.sumelectthermalfe: -975.177062 hartree
dipole: 6.1113 0.0638 0.5315
dipole: 6.1347
quadrupole: -151.5347 -125.5226 -123.3000
quadrupole: 7.6462 5.2597 -2.3827
quadrupole: -18.0823 7.9299 10.1524 7.6462 5.2597 -2.3827
hfenergy: -975.4518707 hartree
pointgroup: C01 [X(C16H19N1O4)]
dipole: 2.4054366 -0.0135806 -0.1975514 debye
polarizability: 283.9251786|8.6020258|171.2045921|-2.0288279|24.823923|140.2240147 unknown
InChI: InChI=1S/C16H19NO4/c18-16(12-7-9-13(10-8-12)17(19)20)21-15-6-2-4-11-3-1-5-14(11)15/h7-11,14-15H,1-6H2
charge 0 multiplicity 1
40 atoms
O  0.782385 0.246127 -0.069333
O  0.123024 1.957808 1.378595
O  -6.546347 0.008522 0.170481
O  -5.805518 -1.619652 -1.244245
N  -5.604773 -0.637085 -0.431482
C  3.065467 -0.637335 -0.098428
C  4.575856 -0.287528 0.020233
C  2.901861 -1.821004 0.882766
C  2.232069 0.620878 0.123358
C  5.239493 -1.68447 -0.023891
C  4.994439 0.766279 -1.020437
C  4.248669 -2.618444 0.755634
C  2.602987 1.721514 -0.894339
C  4.122593 2.039312 -0.852125
C  -0.160783 1.003821 0.61068
C  -1.55886 0.54772 0.318669
C  -2.626725 1.232111 0.954872
C  -1.827503 -0.529428 -0.56544
C  -3.958395 0.849184 0.714855
C  -3.155345 -0.92308 -0.815398
C  -4.200111 -0.225485 -0.169695
H  2.881228 -0.993648 -1.134989
H  4.739381 0.143597 1.033878
H  2.018815 -2.441879 0.654333
H  2.773758 -1.436912 1.913884
H  2.336085 1.000171 1.158931
H  6.25374 -1.686419 0.413679
H  5.335843 -2.014118 -1.077204
H  4.862838 0.350005 -2.040879
H  6.06549 1.025932 -0.913169
H  4.099258 -3.570756 0.216026
H  4.645172 -2.875729 1.754181
H  2.015927 2.634627 -0.687307
H  2.326682 1.364277 -1.906103
H  4.368649 2.519453 0.117126
H  4.359516 2.77844 -1.640386
H  -2.388672 2.058975 1.631024
H  -0.992375 -1.044506 -1.0462
H  -4.801794 1.35665 1.189615
H  -3.396825 -1.74772 -1.490672
