program: Gaussian 09
title: 000268169
version: EM64L-G09RevD.01
frameworkgroup: C1[X(C21H18O3)]
method: RPBEPBE
basis: SDD
operation: Freq
keyword: #pfreq=noraman
keyword: PBEPBE/SDD
title: #p freq=noraman PBEPBE/SDD
converged: YES YES NO NO
title: Mulliken charges:
elementType: O O O C C C C C C C C C C C C C C C C C C C C C H H H H H H H H H H H H H H H H H H
charge: -0.313535 -0.266291 -0.256960 -0.279095 0.352168 0.493406 -0.378137 -0.417702 -0.410572 -0.367035 0.211286 0.218844 -0.235976 -0.231955 -0.220608 -0.234271 -0.248083 -0.241393 -0.325670 -0.341284 -0.348404 -0.339993 0.331901 -0.537472 0.260955 0.251069 0.258853 0.261543 0.253543 0.226601 0.227803 0.224807 0.226108 0.228229 0.228865 0.271105 0.267915 0.256300 0.243494 0.225053 0.225564 0.249026
chargesum: 0.00000
title: Mulliken charges with hydrogens summed into heavy atoms:
elementType: O O O C C C C C C C C C C C C C C C C C C C C C
charge: -0.313535 -0.266291 -0.256960 -0.018139 0.352168 0.493406 -0.127069 -0.158849 -0.149029 -0.113492 0.211286 0.218844 -0.009375 -0.004152 0.004199 -0.008163 -0.019855 -0.012528 -0.054565 -0.073368 -0.092105 -0.096499 0.331901 0.162172
polarizability: 3.01923351e+02 -1.21455520e+01 2.32930900e+02 -1.19595042e+00 2.47822297e+01 1.83989245e+02
1716.lowfreq: -6.6220 -3.4990 -0.0010 -0.0004 0.0006 3.7264 18.3204 20.7603 27.0032
frequency: 18.2966 20.6120 26.9344 43.9815 48.5575 64.1063 72.1807 81.5305 124.8025 138.2922 193.2466 203.7410 214.8660 223.0762 237.2576 276.6083 286.5798 300.9892 329.9464 383.0582 402.4938 405.4036 416.7708 455.8866 465.1423 487.5620 505.8899 569.4680 585.7500 603.8638 616.0673 616.7619 628.1971 645.6837 676.2300 704.0976 705.0079 733.1778 751.7704 755.3560 770.5819 800.0604 821.6820 845.3032 853.6323 856.2054 860.3811 878.2607 894.1405 936.8828 938.7187 970.9784 980.9131 982.5125 984.1715 989.4936 990.0926 992.0593 997.6744 998.1454 998.4365 1027.1432 1029.4995 1041.6344 1083.5552 1084.9907 1112.3146 1112.9974 1155.5328 1170.8127 1172.9962 1173.4574 1187.7483 1191.9481 1192.3926 1223.5803 1233.8672 1245.8986 1280.3453 1296.3469 1305.9500 1322.1754 1346.5891 1380.8213 1381.8370 1387.3304 1428.4042 1434.5335 1437.0482 1446.1792 1468.8600 1471.6183 1482.3735 1485.6115 1496.8086 1571.6424 1589.8540 1595.4540 1613.1544 1613.4502 1615.9542 1620.0431 2966.3363 3003.2110 3057.0868 3122.5643 3123.0930 3130.3287 3130.6375 3130.8151 3140.9815 3143.6949 3150.3949 3153.8956 3156.3276 3158.2779 3164.5028 3170.7351 3174.1409 3178.7193
redmass: 4.9476 3.9076 4.2858 3.9316 5.3343 5.3720 5.3840 4.5391 4.8880 4.7091 4.6331 4.9440 3.6591 1.3937 3.9184 5.2997 5.4882 4.8927 6.6942 5.7273 2.8334 2.8418 2.9743 3.9243 4.4361 3.9627 2.9802 5.0355 6.1261 5.1043 6.3015 6.4421 6.9720 5.2682 4.2104 1.8279 1.8978 3.3612 2.3713 4.5027 2.1021 5.2058 1.3112 3.8177 1.6274 1.2506 1.2512 3.6634 4.6115 1.6062 1.6362 1.3679 1.4449 7.3162 1.4215 1.4370 4.6571 4.7582 3.0193 1.3880 1.3569 2.2678 2.1096 4.1025 1.6162 1.5861 1.2599 1.3369 1.3154 1.1414 1.1525 1.0604 1.6286 1.1318 1.5634 1.7868 2.8396 3.5594 1.7980 1.3122 1.4708 1.3222 1.3269 7.6316 5.6115 5.9649 4.2856 2.2119 1.1808 2.1257 1.0499 1.0780 2.2654 2.3086 2.5037 8.1759 6.1841 6.1667 6.7797 7.4798 6.8139 6.4733 1.0327 1.0827 1.1042 1.0847 1.0847 1.0879 1.0999 1.0882 1.0924 1.0938 1.0966 1.0884 1.0877 1.0972 1.1016 1.0978 1.0966 1.0968
irintensity: 1.4190 0.3615 0.3299 0.2794 0.5308 0.7791 0.2308 0.2636 0.7106 7.1940 1.0776 2.2443 1.0259 0.6547 2.3706 11.1626 7.6716 1.0371 2.0318 4.2782 0.0541 0.2853 0.0724 9.2865 0.2054 2.1869 9.1146 23.4553 28.9141 11.7455 1.4689 0.2187 1.0436 8.4944 27.8394 77.2932 27.0696 27.1043 46.1389 14.2701 50.7661 7.5987 9.2971 8.4903 55.1280 1.0000 0.9601 5.8195 113.8388 3.6528 5.8658 0.7761 1.0406 95.7381 0.9613 0.1887 3.2743 2.6360 56.6516 6.8727 0.2567 5.9650 17.8856 384.2923 9.1978 2.0297 0.1818 7.9810 14.4163 103.7965 123.2821 6.6683 3.5515 2.2085 7.9121 9.5732 59.8299 492.4389 14.1434 12.3690 50.9472 7.9298 1.3777 1.1958 3.5627 0.8703 26.2046 7.8918 9.3921 11.5815 14.7816 46.9353 13.2883 18.0192 71.8069 68.2447 5.6797 0.7956 41.8977 50.6768 33.1527 259.7705 64.2356 18.8930 42.8029 2.0808 0.5400 2.0189 24.2697 3.8892 21.5650 28.7836 27.9454 0.5090 7.2525 34.1591 23.4273 11.2923 7.9359 4.6533
temp: 298.150 k
press: 1.00000 atm
elementType: 8 8 8 6 6 6 6 6 6 6 6 6 6 6 6 6 6 6 6 6 6 6 6 6 1 1 1 1 1 1 1 1 1 1 1 1 1 1 1 1 1 1
symmnumber: 1
zpe: 868058.6 jmol-1
zpe.correction: 0.330626 hartree
zpe.thermalcorrener: 0.351453 hartree
zpe.thermalcorrenthalpy: 0.352397 hartree
zpe.thermalcorrgfe: 0.277535 hartree
zpe.sumelectzpe: -1035.025188 hartree
zpe.sumelectthermal: -1035.004361 hartree
zpe.sumelectthermalent: -1035.003417 hartree
zpe.sumelectthermalfe: -1035.078279 hartree
dipole: -1.2073 1.3080 3.5008
dipole: 3.9274
quadrupole: -117.0491 -129.4487 -136.1363
quadrupole: -8.2235 -9.1202 3.3766
quadrupole: 10.4956 -1.9040 -8.5916 -8.2235 -9.1202 3.3766
hfenergy: -1035.3558141 hartree
pointgroup: C01 [X(C21H18O3)]
dipole: 0.5120517 -0.3422852 -1.4170802 debye
polarizability: 303.6549984|-3.3336581|196.9492828|-7.1511734|-31.9728441|218.2392145 unknown
InChI: InChI=1S/C21H18O3/c1-23-19-14-12-18(13-15-19)21(22)24-20(16-8-4-2-5-9-16)17-10-6-3-7-11-17/h2-15,20H,1H3
charge 0 multiplicity 1
42 atoms
O  -0.128889 0.268132 0.204439
O  0.335416 0.163164 2.496412
O  6.151709 -1.020453 -0.082756
C  -1.586468 0.482299 0.522097
C  -2.132677 1.477058 -0.499863
C  -2.277041 -0.875828 0.563514
C  -3.53597 1.605684 -0.667003
C  -2.560752 -1.478466 1.813635
C  -1.275054 2.339859 -1.224855
C  -2.600856 -1.570046 -0.630062
C  0.727591 0.08249 1.303474
C  2.120271 -0.20184 0.876458
C  -4.069147 2.576675 -1.542112
C  -3.167389 -2.753427 1.872704
C  -1.809262 3.307409 -2.106075
C  -3.200649 -2.845743 -0.572504
C  -3.207623 3.432004 -2.26767
C  -3.488103 -3.440428 0.679635
C  3.120066 -0.342596 1.87969
C  2.482795 -0.341493 -0.486629
C  4.448999 -0.613122 1.5281
C  3.81544 -0.615114 -0.853157
C  4.802482 -0.750294 0.158649
C  6.582499 -1.176741 -1.476518
H  -1.620401 0.929951 1.534901
H  -4.211022 0.942869 -0.113686
H  -2.286789 -0.953611 2.736092
H  -0.192688 2.244228 -1.100086
H  -2.383874 -1.106234 -1.599065
H  -5.155297 2.664027 -1.658682
H  -3.383945 -3.210304 2.84469
H  -1.132504 3.965161 -2.663409
H  -3.445717 -3.37682 -1.499224
H  -3.621235 4.183991 -2.949007
H  -3.956397 -4.430347 0.723509
H  2.8276 -0.2362 2.929236
H  1.710647 -0.241374 -1.254531
H  5.231464 -0.724276 2.284311
H  4.071828 -0.722273 -1.911005
H  6.407822 -0.249901 -2.055836
H  6.064605 -2.025453 -1.962915
H  7.661116 -1.382215 -1.420195
