program: Gaussian 09
title: 000268150
version: EM64L-G09RevD.01
frameworkgroup: C1[X(C17H20O4)]
method: RPBEPBE
basis: SDD
operation: Freq
keyword: #pfreq=noraman
keyword: PBEPBE/SDD
title: #p freq=noraman PBEPBE/SDD
converged: YES YES NO NO
title: Mulliken charges:
elementType: O O O O C C C C C C C C C C C C C C C C C H H H H H H H H H H H H H H H H H H H H
charge: -0.280442 -0.245062 -0.432048 -0.230756 -0.102358 -0.033561 -0.524488 -0.022653 -0.528844 -0.463091 -0.392354 -0.440255 -0.421389 0.186474 0.179731 0.166939 -0.369562 -0.323623 -0.219639 -0.219650 0.095724 0.221279 0.202732 0.224808 0.217257 0.238071 0.212330 0.213191 0.194138 0.203867 0.207920 0.207606 0.237134 0.227342 0.202538 0.207066 0.270650 0.272065 0.239693 0.238681 0.382538
chargesum: 0.00000
title: Mulliken charges with hydrogens summed into heavy atoms:
elementType: O O O O C C C C C C C C C C C C C C C C C
charge: -0.280442 -0.245062 -0.049510 -0.230756 0.118921 0.169172 -0.082423 0.215418 -0.103324 -0.065085 0.023172 0.024221 -0.011785 0.186474 0.179731 0.166939 -0.098912 -0.051558 0.020055 0.019031 0.095724
polarizability: 2.36223694e+02 2.91255472e+01 1.69821514e+02 9.82711103e+00 -1.36347275e+01 1.67577560e+02
1716.lowfreq: -8.6626 -3.1287 -0.0007 -0.0004 -0.0003 4.3435 13.2121 38.6064 40.6638
frequency: 13.1613 38.5698 40.6507 53.2128 75.8296 85.7608 106.1532 114.5579 149.2711 157.4805 182.4796 205.9086 233.0243 264.2899 277.5511 320.6462 346.4944 372.6451 384.3182 405.8780 419.6633 429.1111 484.8399 488.9697 525.9221 550.1854 576.5288 592.6043 600.8457 617.2959 655.1477 676.6194 707.7671 746.4724 761.0623 782.3963 790.4412 797.0551 824.2906 844.8949 856.5350 869.6502 892.1344 900.0427 906.8396 919.5385 946.0938 969.8834 978.0828 999.0245 1005.4557 1016.1191 1028.1970 1033.5360 1059.2654 1073.7490 1077.7195 1088.1776 1111.0868 1115.7692 1126.4589 1147.9796 1162.3847 1176.1473 1178.0874 1181.6042 1207.4334 1229.0487 1237.8387 1241.3600 1255.6904 1267.5887 1277.0639 1282.7967 1290.4706 1297.1267 1300.6581 1309.1496 1312.3697 1327.4735 1331.4935 1344.3986 1348.8243 1369.7766 1381.9442 1428.9095 1464.5554 1467.9434 1469.4972 1474.1012 1475.6475 1477.3617 1488.3715 1577.3359 1602.3499 1609.4210 1648.2581 2927.4785 2957.9939 2966.0227 2972.7339 2982.7326 2987.2021 2999.6382 3008.0075 3009.0118 3028.4455 3040.5072 3043.7579 3061.2478 3073.7621 3079.0683 3138.9675 3154.2334 3168.2000 3180.6174 3524.2339
redmass: 5.0605 5.2876 5.3950 5.5052 1.8047 5.8079 4.5332 4.4900 4.7447 2.6095 4.1773 5.2200 3.6130 4.7348 4.0816 1.9036 9.4724 6.5854 4.1728 3.3020 4.5099 2.7979 3.7835 2.6166 4.5217 2.7847 3.2363 1.5002 3.1283 2.9140 5.3209 4.9074 3.6792 5.9018 1.1849 2.7929 1.8873 3.4009 2.4912 2.5128 1.6069 2.3083 3.0389 2.6854 1.5755 1.7018 2.1344 1.5857 1.4268 4.9195 1.3747 2.6647 1.5028 2.9818 1.8059 2.8144 2.7851 2.3478 1.8851 1.8940 1.7042 1.9364 1.7592 1.5836 1.0656 1.5078 1.4568 1.1768 2.1824 1.4888 1.3578 1.3475 1.4944 1.3033 1.3347 1.2814 1.3169 1.3412 2.4974 1.4504 1.3609 1.4249 1.6264 1.8252 10.5900 2.2069 1.0902 1.0868 1.0818 1.0923 1.0882 2.6569 1.0988 7.4299 6.6556 10.2814 8.9884 1.0810 1.0806 1.0635 1.0640 1.0618 1.0659 1.0798 1.0671 1.0644 1.0982 1.0984 1.1004 1.1002 1.1026 1.1027 1.0864 1.0912 1.0963 1.0981 1.0641
irintensity: 0.0239 1.2331 1.3713 0.2637 0.0720 0.7970 2.2723 0.2128 1.5902 0.3381 3.4505 1.8294 0.6422 3.8230 1.3551 0.7361 1.5653 9.4164 2.3047 3.8851 1.0641 1.6427 0.9253 5.3877 13.3365 3.5958 13.7734 75.7135 43.7449 1.8648 8.9375 4.5056 104.2443 4.3092 4.8519 15.7207 33.4346 0.1116 9.5218 9.1957 13.2772 7.8236 46.4326 1.7017 3.5367 0.1008 10.1010 6.9652 14.8564 202.7279 5.0337 0.9792 26.8828 84.9372 56.7923 127.5001 33.5194 11.7524 63.9201 3.9763 0.8867 1.4601 70.2729 0.8955 0.0726 0.1332 13.8439 5.3312 203.2798 46.7297 0.3241 3.8419 43.6984 7.2100 1.0303 17.3989 14.9224 5.5526 64.8672 0.5318 1.6636 1.6566 1.6044 5.2024 10.0489 8.3254 3.8066 6.3151 10.9358 5.3111 15.3529 18.4242 4.4989 43.5998 52.9384 105.1395 241.6335 9.1859 6.3597 33.1755 35.2403 32.8046 60.0753 14.3190 18.2734 59.4443 50.7004 46.0159 34.4249 21.2510 17.9443 87.5975 2.4823 9.1307 10.4344 12.0039 36.0406
temp: 298.150 k
press: 1.00000 atm
elementType: 8 8 8 8 6 6 6 6 6 6 6 6 6 6 6 6 6 6 6 6 6 1 1 1 1 1 1 1 1 1 1 1 1 1 1 1 1 1 1 1 1
symmnumber: 1
zpe: 882961.8 jmol-1
zpe.correction: 0.336302 hartree
zpe.thermalcorrener: 0.355338 hartree
zpe.thermalcorrenthalpy: 0.356282 hartree
zpe.thermalcorrgfe: 0.286921 hartree
zpe.sumelectzpe: -959.169109 hartree
zpe.sumelectthermal: -959.150074 hartree
zpe.sumelectthermalent: -959.149130 hartree
zpe.sumelectthermalfe: -959.218490 hartree
dipole: -0.5481 -0.6599 -2.5662
dipole: 2.7058
quadrupole: -102.8974 -118.4447 -127.6659
quadrupole: 5.0524 4.7644 -7.6547
quadrupole: 13.4386 -2.1087 -11.3299 5.0524 4.7644 -7.6547
hfenergy: -959.5054114 hartree
pointgroup: C01 [X(C17H20O4)]
dipole: 0.1917113 0.43897 -0.9506769 debye
polarizability: 231.4210293|35.1716239|170.1810825|-5.2994852|13.1551227|172.0206571 unknown
InChI: InChI=1S/C17H20O4/c18-16(19)13-7-1-2-8-14(13)17(20)21-15-10-4-6-11-5-3-9-12(11)15/h1-2,7-8,11-12,15,18H,3-6,9-10H2
charge 0 multiplicity 1
41 atoms
O  -0.139544 0.188563 0.260557
O  0.602814 0.104871 2.474365
O  2.363994 -1.241397 -2.569632
O  1.359853 -2.075204 -0.652337
C  -2.484322 0.370973 -0.38396
C  -3.950421 -0.016566 -0.041897
C  -2.569675 1.897951 -0.608347
C  -1.542433 -0.1581 0.693366
C  -4.750674 0.762771 -1.112808
C  -4.119965 -1.543338 0.050693
C  -3.971335 2.11393 -1.282691
C  -1.668441 -1.690304 0.841474
C  -3.138346 -2.108898 1.112288
C  0.83348 0.217893 1.244562
C  2.189716 0.533419 0.674829
C  2.713866 -0.029521 -0.526096
C  2.951179 1.498269 1.377106
C  3.959006 0.43057 -1.026334
C  4.197068 1.937732 0.881226
C  4.694898 1.414037 -0.33339
C  2.057158 -1.190439 -1.197538
H  -2.217873 -0.124134 -1.342701
H  -4.187989 0.41907 0.955391
H  -1.738026 2.281399 -1.223292
H  -2.524109 2.420636 0.367381
H  -1.718834 0.342342 1.666806
H  -5.806735 0.917433 -0.827075
H  -4.747665 0.191389 -2.062114
H  -3.905807 -1.998128 -0.939085
H  -5.161218 -1.81299 0.314457
H  -3.8653 2.375448 -2.35095
H  -4.512421 2.948466 -0.801146
H  -1.013287 -2.040648 1.658384
H  -1.305709 -2.160439 -0.09194
H  -3.446245 -1.74661 2.114943
H  -3.198065 -3.213394 1.143701
H  2.546067 1.901742 2.310391
H  4.345893 -0.005732 -1.951161
H  4.77048 2.688154 1.435534
H  5.656059 1.756672 -0.730592
H  1.947008 -2.058585 -2.955066
