program: Gaussian 09
title: 000268126
version: EM64L-G09RevD.01
frameworkgroup: C1[X(C11H16N2O)]
method: RPBEPBE
basis: SDD
operation: Freq
keyword: #p
keyword: freq=noraman
keyword: PBEPBE/SDD
title: #p freq=noraman PBEPBE/SDD
converged: YES YES NO NO
title: Mulliken charges:
elementType: O N N C C C C C C C C C C C H H H H H H H H H H H H H H H H
charge: -0.285940 -0.138996 -0.704440 -0.331783 -0.379249 0.117564 0.355084 -0.667282 -0.650142 -0.585855 -0.431526 0.513101 -0.200004 -0.426758 0.257212 0.198041 0.259591 0.212139 0.205997 0.254226 0.212242 0.213111 0.229752 0.216861 0.252409 0.251150 0.220685 0.218082 0.310371 0.304360
chargesum: 0.00000
title: Mulliken charges with hydrogens summed into heavy atoms:
elementType: O N N C C C C C C C C C C C
charge: -0.285940 -0.138996 -0.089710 0.123469 0.092481 0.117564 0.355084 0.005182 0.009582 -0.333446 -0.180376 0.513101 0.020681 -0.208676
polarizability: 1.85734176e+02 -8.66349955e-01 1.09595287e+02 7.14085481e+00 1.66029699e+01 1.20598157e+02
1716.lowfreq: -11.5088 -7.7064 -0.0006 -0.0005 -0.0004 2.6313 27.5678 40.3922 54.3279
frequency: 27.4006 40.0525 54.2552 70.5988 105.2623 129.3697 180.6793 201.8249 216.1052 224.3393 266.8750 301.4200 334.9720 359.7448 373.9238 377.3150 385.8721 425.3415 480.5218 509.2145 528.8469 593.4297 624.4806 682.3310 701.1569 727.9228 769.9049 781.2173 793.8977 824.0596 879.4076 888.9591 920.2368 939.1291 963.7102 981.2975 1005.9799 1035.2539 1067.3272 1079.7780 1084.8327 1096.8145 1109.1884 1178.1039 1181.7629 1210.5945 1265.6981 1294.6645 1309.4196 1327.6078 1344.7521 1358.2179 1382.1629 1384.1647 1391.3005 1405.6947 1453.1063 1456.9560 1464.8036 1467.1106 1475.3406 1482.3877 1484.1685 1488.2276 1549.4844 1587.6414 1625.7886 1642.9150 2983.3121 2983.6906 2994.0382 3011.3182 3065.6019 3074.1898 3081.0265 3085.1686 3101.1813 3104.2273 3117.2708 3133.8287 3134.5600 3155.6648 3567.3679 3707.9164
redmass: 3.2393 3.0938 3.0448 3.5847 3.5038 3.0493 4.3932 1.3117 1.2328 2.2985 3.1113 2.7612 3.1090 1.1985 3.2203 1.2518 2.1202 2.7791 3.3740 3.4403 6.0511 3.9023 5.4077 4.0340 2.9316 3.5639 1.4178 1.1991 1.4979 2.4736 1.4384 1.7016 2.5455 2.1247 1.3225 5.9026 2.1838 1.7349 2.1028 1.9389 1.8366 1.8228 1.4661 1.1145 2.0704 2.7539 1.5361 1.4115 1.3401 2.0940 1.2400 1.2926 1.2113 1.2374 6.9690 2.3000 1.1674 3.2846 1.0467 1.0436 1.1353 1.1341 1.0689 2.5072 5.9156 6.2509 3.7823 1.3199 1.0351 1.0357 1.0684 1.0599 1.1020 1.0978 1.1001 1.0980 1.1013 1.0987 1.0863 1.0916 1.0911 1.0989 1.0449 1.1040
irintensity: 1.1965 1.7021 0.7465 2.8696 4.0069 0.3176 0.7909 1.9825 2.4701 3.8926 0.1192 2.4196 1.5456 239.9866 17.1250 57.6463 6.9861 5.6809 3.7282 5.0727 1.9317 2.8932 8.3214 2.6061 6.4669 32.3795 0.7193 6.9407 55.7563 44.2382 3.1339 26.3600 4.6306 7.5034 1.8021 9.6813 0.7634 13.8059 19.4039 4.6325 27.3385 15.2053 12.3188 4.7095 13.7950 22.4851 95.1673 10.4288 26.5892 68.4319 16.8688 9.2669 4.1898 38.0496 19.8446 115.1115 28.3418 77.3422 5.1949 11.7181 19.8612 9.2717 18.3201 9.7049 237.1776 12.4112 55.7734 250.7881 23.5128 31.0816 39.6428 40.9783 5.3123 14.0653 45.8971 37.0135 22.3786 39.2977 9.2795 11.6486 21.9178 17.8606 67.2273 20.4197
temp: 298.150 k
press: 1.00000 atm
elementType: 8 7 7 6 6 6 6 6 6 6 6 6 6 6 1 1 1 1 1 1 1 1 1 1 1 1 1 1 1 1
symmnumber: 1
zpe: 661874.0 jmol-1
zpe.correction: 0.252094 hartree
zpe.thermalcorrener: 0.267109 hartree
zpe.thermalcorrenthalpy: 0.268054 hartree
zpe.thermalcorrgfe: 0.209111 hartree
zpe.sumelectzpe: -612.450176 hartree
zpe.sumelectthermal: -612.435161 hartree
zpe.sumelectthermalent: -612.434217 hartree
zpe.sumelectthermalfe: -612.493160 hartree
dipole: -1.3503 3.4009 -0.6112
dipole: 3.7098
quadrupole: -60.5906 -92.1765 -79.3971
quadrupole: 5.1395 5.2529 2.9446
quadrupole: 16.7974 -14.7884 -2.0091 5.1395 5.2529 2.9446
hfenergy: -612.7022706 hartree
pointgroup: C01 [X(C11H16N2O1)]
dipole: 0.6541532 0.9678641 -0.8750074 debye
polarizability: 185.3141556|0.2777225|100.1062465|8.1065742|9.5055341|130.5072178 unknown
InChI: InChI=1S/C11H16N2O/c1-3-13(4-2)11(14)9-6-5-7-10(12)8-9/h5-8H,3-4,12H2,1-2H3
charge 0 multiplicity 1
30 atoms
O  -1.178603 -0.599019 1.817191
N  -1.902688 0.381649 -0.16378
N  3.927672 0.56755 1.439069
C  -3.302137 0.283515 0.328648
C  -1.662997 1.237749 -1.350622
C  -0.905043 -0.148114 0.653797
C  0.512504 -0.213912 0.131271
C  -3.944629 -1.072116 -0.031922
C  -1.717931 2.747334 -1.020417
C  1.546508 0.228729 0.983581
C  0.827222 -0.815579 -1.116525
C  2.911098 0.113716 0.596774
C  2.182149 -0.947656 -1.494751
C  3.21876 -0.48099 -0.662364
H  -3.29205 0.406099 1.425911
H  -3.879402 1.116779 -0.11071
H  -0.676755 0.996768 -1.774313
H  -2.421886 0.988036 -2.11754
H  -3.956827 -1.2331 -1.125451
H  -3.379038 -1.893807 0.439011
H  -4.986693 -1.114731 0.335853
H  -2.690595 3.036256 -0.582899
H  -0.924073 3.013211 -0.300222
H  -1.567193 3.344007 -1.93914
H  1.28222 0.639516 1.965103
H  0.031913 -1.21334 -1.755877
H  2.434587 -1.426146 -2.448013
H  4.26558 -0.5869 -0.973123
H  3.71065 0.954748 2.352521
H  4.904078 0.45845 1.182438
