program: Gaussian 09
title: 000268111
version: EM64L-G09RevD.01
frameworkgroup: C1[X(C12H19NOS)]
method: RPBEPBE
basis: SDD
operation: Freq
keyword: #p
keyword: freq=noraman
keyword: PBEPBE/SDD
title: #p freq=noraman PBEPBE/SDD
converged: YES YES NO NO
title: Mulliken charges:
elementType: S O N C C C C C C C C C C C C H H H H H H H H H H H H H H H H H H H
charge: 0.159263 -0.429453 -0.084771 -0.652279 -0.690650 -0.283797 0.536496 -0.335596 -0.379013 -0.368330 -0.609943 -0.616427 -0.234812 -0.254911 -0.240415 0.266636 0.261530 0.273081 0.216269 0.220077 0.226841 0.219878 0.241844 0.265943 0.221120 0.196786 0.217743 0.221378 0.189696 0.226353 0.226718 0.226125 0.229324 0.337291
chargesum: 0.00000
title: Mulliken charges with hydrogens summed into heavy atoms:
elementType: S O N C C C C C C C C C C C C
charge: 0.159263 -0.092162 -0.084771 -0.385642 -0.156039 0.152550 0.536496 0.111123 -0.137169 -0.102387 0.025706 0.021000 -0.008093 -0.028786 -0.011090
polarizability: 1.55070463e+02 -7.61992449e+00 1.66956536e+02 -4.07996120e-01 -6.11740692e+00 1.39149421e+02
1716.lowfreq: -19.2246 -1.3116 -0.0018 -0.0006 0.0004 9.0204 11.2487 35.8090 40.6024
frequency: -6.7168 35.7416 40.2042 50.6183 85.0728 94.2544 116.3026 144.1882 181.0850 197.2852 209.7425 214.6722 243.0673 252.7350 294.2322 300.1622 341.9541 360.8385 399.2005 409.7976 443.1403 456.5862 472.0773 578.9137 615.6881 676.1851 692.4334 702.1079 746.3551 769.8231 784.1831 814.1791 849.5138 919.8127 935.4467 973.8450 981.1139 990.1985 995.1688 999.5502 1015.9138 1027.0571 1034.5635 1048.8488 1066.5264 1087.8835 1090.5991 1120.2108 1142.4472 1149.5170 1172.8245 1190.6181 1196.4316 1211.2762 1219.7428 1246.5278 1264.0031 1300.6887 1302.6957 1321.1543 1345.5691 1362.8067 1371.5938 1384.7801 1419.8723 1436.5362 1440.0820 1443.3196 1461.4782 1465.1772 1472.1103 1473.9727 1476.6888 1486.0912 1486.1417 1590.5148 1611.0228 2853.0572 2864.0422 2887.3906 2992.9673 3002.9591 3018.0936 3025.2951 3030.8835 3034.9130 3076.6198 3081.7636 3083.2538 3107.9927 3118.1977 3127.3602 3140.7106 3156.1449 3168.1118 3564.7104
redmass: 3.1911 3.9817 3.4530 4.2835 3.4773 2.3068 3.2719 3.5309 3.3359 4.1420 2.3895 1.1150 1.1815 2.5666 1.6958 3.5312 2.5573 7.1368 2.8063 2.6246 2.4513 3.9750 3.5315 3.4475 6.3569 4.6131 4.6872 1.6821 1.2262 3.6507 2.0550 4.4029 1.2531 1.4702 3.4236 1.4523 1.9823 3.2109 1.4488 1.5960 2.5961 2.3696 1.5718 2.7253 2.7468 1.5388 1.3212 1.2793 1.3098 1.5197 1.0574 1.1754 1.1214 2.2115 1.3782 1.5811 2.4926 1.2262 1.2853 1.3869 1.3680 1.3323 1.2010 6.2652 1.1404 1.2325 1.7535 1.1599 1.0484 1.0625 1.0962 1.0638 1.0684 1.9683 1.1150 5.9151 5.9455 1.0565 1.0577 1.0681 1.0690 1.0812 1.0728 1.0731 1.0731 1.0746 1.1010 1.0989 1.1004 1.1060 1.0861 1.0873 1.0931 1.0963 1.0991 1.0664
irintensity: 0.2123 0.1576 0.4163 0.4935 0.9729 0.7632 4.4020 1.1488 0.1101 0.6412 20.6944 2.3918 0.3093 20.4474 124.3799 26.1661 11.3255 2.8649 0.3077 1.1030 0.8912 29.0419 9.3342 1.0511 0.3274 10.9889 3.3031 106.4355 16.6804 0.2348 14.9239 14.0296 0.2011 3.8892 109.9449 0.4571 1.9337 0.6510 0.1052 7.4582 23.9494 4.2963 20.7135 8.6239 22.2281 6.3535 5.1628 6.9198 26.1036 18.3108 0.1055 1.3786 0.4234 4.6705 1.2582 9.8704 7.1705 4.8109 14.8217 5.2073 1.2470 2.1032 16.0590 0.2570 1.7144 1.5696 12.7043 2.1100 16.3884 3.1592 10.5739 16.2825 35.5559 8.0357 18.7225 1.2007 2.3619 79.7594 99.5922 89.1454 34.6406 12.5931 48.6878 19.5492 38.6122 20.4993 24.4455 27.6766 45.8928 13.5836 3.5505 1.1405 25.4271 30.7439 8.4126 10.4761
temp: 298.150 k
press: 1.00000 atm
elementType: 16 8 7 6 6 6 6 6 6 6 6 6 6 6 6 1 1 1 1 1 1 1 1 1 1 1 1 1 1 1 1 1 1 1
symmnumber: 1
zpe: 751489.5 jmol-1
zpe.correction: 0.286227 hartree
zpe.thermalcorrener: 0.302544 hartree
zpe.thermalcorrenthalpy: 0.303488 hartree
zpe.thermalcorrgfe: 0.241661 hartree
zpe.sumelectzpe: -995.503870 hartree
zpe.sumelectthermal: -995.487553 hartree
zpe.sumelectthermalent: -995.486609 hartree
zpe.sumelectthermalfe: -995.548436 hartree
dipole: -0.3864 1.5217 0.9962
dipole: 1.8593
quadrupole: -96.0060 -99.4147 -98.3329
quadrupole: -5.4166 5.7239 -0.1160
quadrupole: 1.9119 -1.4969 -0.4150 -5.4166 5.7239 -0.1160
hfenergy: -995.7900968 hartree
pointgroup: C01 [X(C12H19N1O1S1)]
dipole: -0.1258217 -0.5926535 0.4099378 debye
polarizability: 150.9587225|-1.0312447|171.0413992|3.6515645|4.0414465|139.1762977 unknown
InChI: InChI=1S/C12H19NOS/c1-13(2)8-9-15-12(10-14)11-6-4-3-5-7-11/h3-7,12,14H,8-10H2,1-2H3
charge 0 multiplicity 1
34 atoms
S  0.660686 2.395139 0.910906
O  -2.776421 2.338981 -1.488871
N  3.381475 -0.591188 -0.211391
C  -1.110811 1.847589 0.343537
C  1.78477 1.334341 -0.19124
C  2.400006 0.166122 0.602549
C  -1.261228 0.337936 0.291212
C  -1.439175 2.629507 -0.944612
C  -1.316578 -0.396092 1.506825
C  -1.343286 -0.372914 -0.933571
C  2.749739 -1.436752 -1.246592
C  4.326113 -1.363023 0.622521
C  -1.44174 -1.80072 1.502205
C  -1.459623 -1.78252 -0.940581
C  -1.508254 -2.502241 0.274067
H  -1.714698 2.245637 1.182861
H  1.180387 0.982397 -1.043411
H  2.574902 2.002052 -0.570761
H  2.932571 0.58283 1.477784
H  1.580233 -0.483454 0.99733
H  -1.315451 3.711857 -0.741216
H  -0.747248 2.359071 -1.759983
H  -1.245113 0.143349 2.459455
H  -1.359095 0.172213 -1.881885
H  2.142081 -0.821199 -1.931484
H  2.084446 -2.228424 -0.817183
H  3.534524 -1.930667 -1.847179
H  5.09289 -1.829953 -0.022041
H  3.835357 -2.176102 1.216027
H  4.840418 -0.686737 1.328223
H  -1.485999 -2.348052 2.450647
H  -1.527016 -2.315632 -1.895793
H  -1.605548 -3.593727 0.266342
H  -3.460714 2.546979 -0.803597
