program: Gaussian 09
title: 000268101
version: EM64L-G09RevD.01
frameworkgroup: C1[X(C14H13N3O2)]
method: RPBEPBE
basis: SDD
operation: Freq
keyword: #p
keyword: freq=noraman
keyword: PBEPBE/SDD
title: #p freq=noraman PBEPBE/SDD
converged: YES YES NO NO
title: Mulliken charges:
elementType: O O N N N C C C C C C C C C C C C C C H H H H H H H H H H H H H
charge: -0.269718 -0.207294 -0.251606 -0.058517 0.008455 0.228432 -0.584162 0.174284 0.134986 -0.279722 -0.237605 0.205132 -0.185435 -0.176869 -0.765422 -0.359444 -0.359554 -0.183304 -0.164855 0.273205 0.278621 0.313866 0.259108 0.240995 0.243661 0.291286 0.247476 0.226432 0.241918 0.246807 0.233494 0.235349
chargesum: 0.00000
title: Mulliken charges with hydrogens summed into heavy atoms:
elementType: O O N N N C C C C C C C C C C C C C C
charge: -0.269718 -0.207294 -0.251606 -0.058517 0.008455 0.228432 -0.032336 0.174284 0.134986 0.034143 0.021502 0.205132 0.055560 0.066792 -0.000229 -0.117526 -0.112747 0.050190 0.070495
polarizability: 2.03898984e+02 7.35404583e+00 2.06161772e+02 -5.88662768e+00 -8.84632496e-01 1.18917563e+02
1716.lowfreq: -11.0375 -5.5308 -0.0003 0.0001 0.0005 2.9573 18.6907 19.6782 37.1019
frequency: 17.9222 19.6039 36.9805 53.0005 66.8130 89.6312 91.2118 104.5999 140.5848 205.5245 216.4672 227.1983 289.5435 314.2222 364.6337 386.9852 408.4998 412.1696 429.6582 475.2513 503.8173 509.8089 534.5450 589.2559 611.1832 620.1756 641.6516 687.1603 742.7960 745.2957 750.4703 784.1804 787.0902 801.0970 873.3760 894.5235 900.2938 913.7241 950.5779 957.1767 958.5070 961.2670 976.5343 1000.2058 1002.6537 1011.0346 1028.0971 1040.0652 1044.4196 1089.4011 1092.3394 1154.3921 1162.6073 1166.4708 1180.0867 1230.0650 1239.8554 1265.1179 1288.8736 1297.5983 1312.3627 1327.8963 1337.9550 1365.6207 1411.5312 1416.8572 1423.1660 1441.1596 1445.2606 1451.4721 1454.8811 1561.1086 1567.0960 1574.9724 1579.6272 1600.6626 1639.5100 2981.5035 2996.3302 3068.2956 3070.9681 3125.4762 3132.5992 3136.9228 3147.4284 3149.7896 3167.9886 3173.9637 3180.0749 3214.9452
redmass: 5.1191 5.0621 4.7431 4.3354 4.8595 4.1721 5.8031 3.8172 1.1672 4.9359 4.3837 5.0500 6.6415 5.7450 2.3665 7.0096 3.4826 3.6468 5.5386 3.1644 3.6975 3.0847 3.4309 4.4269 7.3571 5.9681 5.5874 5.7790 2.3496 2.2559 3.3317 2.2881 1.8497 3.7397 1.9309 1.3092 1.3004 3.5594 5.2716 1.4803 1.6369 4.5497 6.6824 1.3490 1.3230 1.8857 1.9213 2.2827 2.1862 1.6366 1.6236 1.3357 1.0748 1.1072 2.7599 2.8882 3.0402 3.1449 1.6861 1.6818 3.2065 3.7750 6.6107 1.3073 1.9293 2.1893 1.1175 2.0713 1.0766 2.0329 1.1095 5.8560 6.2510 5.7979 6.0211 8.2940 7.7377 1.0373 1.0601 1.0957 1.0981 1.1008 1.0887 1.0883 1.0909 1.0902 1.0955 1.0996 1.1016 1.0952
irintensity: 3.4282 1.6672 4.5595 3.1818 1.8572 6.9377 0.4138 1.1868 0.4312 2.0912 9.5233 1.2837 3.1345 4.0681 1.2397 6.3620 3.1452 3.6492 0.1526 0.8928 9.3494 11.3431 20.8583 1.6849 4.9503 2.9454 13.0950 16.5008 16.8692 24.6014 11.6277 8.7885 73.0554 8.8187 1.7007 0.8422 1.7150 1.8307 6.9606 1.1613 2.7938 2.8812 5.0967 0.0921 1.5814 3.5408 15.6627 2.7527 6.9789 3.9491 9.2404 9.1205 1.7279 12.5124 90.4126 198.9451 214.0203 97.9494 3.4200 142.6031 70.8599 85.4478 48.6402 95.1625 39.4693 62.0408 21.9993 177.5680 39.8611 84.4896 20.2925 51.3144 15.7236 103.6529 111.8222 124.2616 137.3775 8.4977 0.2620 9.6676 6.8472 13.5954 12.9983 8.7098 14.0981 8.4201 24.3119 25.5118 8.8161 8.2654
temp: 298.150 k
press: 1.00000 atm
elementType: 8 8 7 7 7 6 6 6 6 6 6 6 6 6 6 6 6 6 6 1 1 1 1 1 1 1 1 1 1 1 1 1
symmnumber: 1
zpe: 638780.2 jmol-1
zpe.correction: 0.243299 hartree
zpe.thermalcorrener: 0.260382 hartree
zpe.thermalcorrenthalpy: 0.261326 hartree
zpe.thermalcorrgfe: 0.195017 hartree
zpe.sumelectzpe: -854.637689 hartree
zpe.sumelectthermal: -854.620605 hartree
zpe.sumelectthermalent: -854.619661 hartree
zpe.sumelectthermalfe: -854.685971 hartree
dipole: -3.5318 2.8627 -0.3999
dipole: 4.5639
quadrupole: -110.7188 -93.4897 -112.6249
quadrupole: 8.5317 -13.9079 3.1991
quadrupole: -5.1076 12.1214 -7.0138 8.5317 -13.9079 3.1991
hfenergy: -854.8809877 hartree
pointgroup: C01 [X(C14H13N3O2)]
dipole: 1.4816572 -0.9636339 -0.3164884 debye
polarizability: 202.2468789|6.8161548|207.8087327|-5.4504724|-2.7090226|118.922707 unknown
InChI: InChI=1S/C14H13N3O2/c1-11(18)10-14(19)17(12-6-2-4-8-15-12)13-7-3-5-9-16-13/h2-9H,10H2,1H3
charge 0 multiplicity 1
32 atoms
O  -1.456975 2.023203 0.061931
O  -4.224751 0.329765 2.01716
N  -0.00525 0.176674 0.146078
N  2.301591 0.107263 -0.305068
N  -0.389433 -1.93077 -0.924573
C  -1.286391 0.776815 0.190163
C  -2.457189 -0.188515 0.441716
C  1.224591 0.904912 -0.048508
C  0.105311 -1.278164 0.157318
C  1.323896 2.321807 0.028832
C  0.684919 -1.931907 1.267903
C  -3.757474 0.518248 0.863257
C  2.593218 2.903839 -0.169533
C  0.761606 -3.339495 1.248769
C  -4.445534 1.39249 -0.165642
C  3.515139 0.691923 -0.491289
C  -0.313909 -3.294187 -0.928952
C  3.717014 2.087931 -0.43603
C  0.254988 -4.038585 0.127203
H  -2.191844 -0.914464 1.230197
H  -2.626752 -0.762552 -0.490304
H  0.438335 2.926132 0.218094
H  1.069951 -1.347644 2.107759
H  2.696995 3.992702 -0.115527
H  1.206648 -3.879577 2.090564
H  -3.760258 2.214217 -0.443735
H  -5.3843 1.797773 0.241559
H  -4.654373 0.817168 -1.087897
H  4.34523 0.00638 -0.696087
H  -0.722478 -3.790675 -1.815982
H  4.71188 2.513382 -0.596463
H  0.296404 -5.130593 0.071084
