program: Gaussian 09
title: 000268088
version: EM64L-G09RevD.01
frameworkgroup: C1[X(C13H11ClN4)]
method: RPBEPBE
basis: SDD
operation: Freq
keyword: #p
keyword: freq=noraman
keyword: PBEPBE/SDD
title: #p freq=noraman PBEPBE/SDD
converged: YES YES NO NO
title: Mulliken charges:
elementType: Cl N N N N C C C C C C C C C C C C C H H H H H H H H H H H
charge: 0.020373 -0.182427 -0.034836 -0.016490 0.059756 -0.187072 0.420685 0.130664 -0.721962 -0.198121 0.135519 -0.362829 -0.400344 -0.308047 -0.233042 -0.236385 -0.232673 -0.361617 0.264012 0.234023 0.251592 0.219829 0.291238 0.244826 0.248143 0.233587 0.231014 0.235218 0.255366
chargesum: 0.00000
title: Mulliken charges with hydrogens summed into heavy atoms:
elementType: Cl N N N N C C C C C C C C C C C C C
charge: 0.020373 -0.182427 -0.034836 -0.016490 0.059756 0.076940 0.420685 0.130664 -0.016518 0.093116 0.135519 -0.118004 -0.152201 -0.308047 0.000546 -0.005371 0.002546 -0.106252
polarizability: 2.40840540e+02 -8.88597257e+00 1.48612980e+02 -1.84277322e+01 6.66013299e+00 1.27507855e+02
1716.lowfreq: -2.8967 -0.0017 -0.0013 0.0012 2.8958 10.1893 21.2613 24.6732 41.0789
frequency: 20.1967 24.4533 41.0692 83.0650 129.2532 155.5028 193.8420 213.3193 236.7471 251.1322 261.1003 288.4575 347.3398 377.9481 402.1155 451.4807 477.5331 522.6867 548.0491 561.9814 615.7320 622.0332 626.6889 647.8284 652.2544 688.3638 707.2579 767.6883 790.3250 792.1204 802.3801 857.0551 860.9190 896.8724 914.5204 929.1813 982.8130 989.3281 996.8049 1002.1694 1022.7799 1037.1973 1075.6453 1083.3663 1109.4357 1120.3812 1169.2062 1176.5771 1185.5267 1194.6110 1217.8437 1266.3001 1284.3340 1301.9408 1307.4680 1340.1270 1359.5840 1377.3839 1384.6134 1393.8663 1398.8490 1438.8851 1440.9130 1476.4290 1482.4135 1487.0781 1503.4843 1561.1158 1595.2950 1615.8751 2994.9755 3007.1844 3094.9331 3101.6036 3121.7056 3131.7050 3144.3305 3155.2581 3169.0132 3185.4395 3239.8169
redmass: 5.3231 3.8897 7.3419 5.9278 6.4082 5.6221 6.0945 6.4874 4.2982 4.0581 4.2829 1.1110 4.6950 15.7938 2.8016 3.8897 3.4641 5.9914 5.1948 7.1253 5.9914 4.6609 6.8662 6.2795 5.0451 4.5876 1.6055 2.6591 4.9988 2.9850 9.3251 1.2650 1.4259 6.8530 1.4306 1.3830 1.4076 4.2152 2.8058 1.3506 2.1594 1.8015 2.0862 2.8173 3.5812 2.6375 4.5716 1.0518 2.0931 1.1219 2.2492 2.5664 9.1878 2.6628 1.8830 1.3538 5.1173 1.5123 7.1268 1.2237 1.9078 4.2968 2.2164 1.0586 1.0916 2.1280 8.8628 11.1616 6.0897 6.0129 1.0374 1.0828 1.1003 1.1002 1.0878 1.0864 1.0916 1.0954 1.1014 1.0929 1.0987
irintensity: 0.4068 0.1022 0.0218 0.5733 0.3215 1.2480 0.8896 1.3290 0.9504 0.4941 0.3182 0.2674 0.1491 7.5964 0.3574 4.7384 3.7713 13.1700 1.2279 15.7294 0.4600 1.3802 5.5020 3.8231 18.4178 16.5869 75.9782 4.8275 9.5137 29.5811 24.2128 1.1835 10.8089 99.1640 12.3669 4.6807 0.0464 0.9637 7.5808 1.2232 10.1490 1.0539 9.6572 49.7253 3.1341 0.8968 62.9952 0.0503 90.4391 1.9040 44.3904 10.8700 43.9705 94.9161 12.1603 2.5216 33.1791 12.8696 2.3735 19.7844 59.9891 88.2832 21.5062 15.9888 5.6424 13.5523 131.8091 113.9626 1.4010 3.2067 12.0498 5.3362 19.6623 25.6663 7.4197 0.0080 14.1888 30.1558 18.1762 9.9373 0.3649
temp: 298.150 k
press: 1.00000 atm
elementType: 17 7 7 7 7 6 6 6 6 6 6 6 6 6 6 6 6 6 1 1 1 1 1 1 1 1 1 1 1
symmnumber: 1
zpe: 571121.7 jmol-1
zpe.correction: 0.217529 hartree
zpe.thermalcorrener: 0.232275 hartree
zpe.thermalcorrenthalpy: 0.233219 hartree
zpe.thermalcorrgfe: 0.173149 hartree
zpe.sumelectzpe: -1179.786279 hartree
zpe.sumelectthermal: -1179.771533 hartree
zpe.sumelectthermalent: -1179.770589 hartree
zpe.sumelectthermalfe: -1179.830659 hartree
dipole: 6.4360 1.7348 -0.2995
dipole: 6.6724
quadrupole: -116.9734 -112.9467 -107.3088
quadrupole: -7.4665 -3.4571 -6.1384
quadrupole: -4.5638 -0.5370 5.1008 -7.4665 -3.4571 -6.1384
hfenergy: -1180.0038079 hartree
pointgroup: C01 [X(C13H11Cl1N4)]
dipole: 2.4998118 -0.1443735 0.7882734 debye
polarizability: 241.0334912|20.3015867|134.3237469|2.4054407|-11.099762|141.6041378 unknown
InChI: InChI=1S/C13H11ClN4/c1-9(10-5-3-2-4-6-10)18-8-17-11-12(14)15-7-16-13(11)18/h2-9H,1H3
charge 0 multiplicity 1
29 atoms
Cl -4.786689 0.902153 -1.548597
N  -0.161995 0.25178 0.393257
N  -1.503732 1.484584 -1.01914
N  -1.83225 -1.378884 1.21456
N  -4.041099 -1.010005 0.231495
C  1.02273 -0.175845 1.200641
C  2.289211 -0.13507 0.335681
C  -1.432741 -0.314655 0.472009
C  1.077461 0.636552 2.510631
C  -0.268001 1.322136 -0.507438
C  -2.257344 0.464386 -0.416923
C  2.366847 -0.985498 -0.798942
C  3.386015 0.709435 0.631074
C  -3.601773 0.038393 -0.484753
C  3.512601 -0.989592 -1.620762
C  4.537297 0.706817 -0.191476
C  4.60422 -0.140341 -1.319143
C  -3.15224 -1.673687 1.043936
H  0.802693 -1.229604 1.461012
H  1.904687 0.281267 3.149303
H  0.134961 0.505744 3.068206
H  1.218087 1.715036 2.319109
H  0.590511 1.936798 -0.768641
H  1.523802 -1.645878 -1.037526
H  3.356405 1.369214 1.504342
H  3.557246 -1.652426 -2.491751
H  5.379086 1.364957 0.050464
H  5.495898 -0.142447 -1.955513
H  -3.551393 -2.520621 1.606882
