program: Gaussian 09
title: 000268076
version: EM64L-G09RevD.01
frameworkgroup: C1[X(C15H19N3O2)]
method: RPBEPBE
basis: SDD
operation: Freq
keyword: #p
keyword: freq=noraman
keyword: PBEPBE/SDD
title: #p freq=noraman PBEPBE/SDD
converged: NO YES NO NO
title: Mulliken charges:
elementType: O O N N N C C C C C C C C C C C C C C C H H H H H H H H H H H H H H H H H H H
charge: -0.443966 -0.276371 -0.192627 -0.478092 -0.011569 -0.090951 -0.041684 -0.443479 -0.449116 -0.394855 -0.401521 -0.221078 0.257238 0.494927 -0.449560 -0.340528 0.452083 -0.400004 -0.356719 -0.811258 0.278701 0.256167 0.229778 0.192354 0.225146 0.221366 0.207886 0.209371 0.198640 0.213705 0.377944 0.335256 0.218466 0.298570 0.228033 0.227386 0.227003 0.220615 0.232741
chargesum: 0.00000
title: Mulliken charges with hydrogens summed into heavy atoms:
elementType: O O N N N C C C C C C C C C C C C C C C
charge: -0.066022 -0.276371 -0.192627 -0.142836 -0.011569 0.187750 0.214483 -0.021346 -0.002604 0.022402 0.010824 -0.221078 0.257238 0.494927 -0.231094 -0.041958 0.452083 -0.171971 -0.129333 -0.130898
polarizability: 2.83573859e+02 -2.27463008e+01 1.32285213e+02 -1.41546915e+00 -5.92227013e+00 1.61756090e+02
1716.lowfreq: -6.0715 -0.0005 -0.0005 -0.0001 2.4251 3.5602 23.4803 30.3324 41.8182
frequency: 23.4457 30.3022 41.8157 43.8554 70.6999 81.7190 91.0439 117.8742 135.4055 172.2090 177.4663 200.9022 224.4027 248.7577 278.1353 301.1089 326.3597 338.0417 358.6790 372.7152 399.5753 408.7598 415.4800 441.0954 469.3223 497.7008 517.4246 529.9771 536.1338 547.6222 635.9375 660.6842 678.4340 716.7587 735.5825 754.0833 773.8778 797.8062 822.9560 838.9541 846.1590 851.5184 855.0690 884.1628 925.6061 941.4698 951.8059 980.4129 983.6300 991.0983 1009.6785 1031.3752 1042.0706 1047.6845 1056.9397 1088.9283 1108.9244 1118.5480 1129.1463 1139.5072 1189.6157 1193.0228 1201.2210 1224.2340 1235.2994 1244.4997 1263.7027 1267.9126 1275.8704 1293.9254 1309.8678 1311.7950 1318.4121 1339.3648 1342.1796 1347.3290 1351.2573 1372.5618 1397.6515 1414.2838 1463.1184 1465.2358 1470.2610 1471.0489 1474.2627 1475.6448 1507.2015 1522.0309 1594.8463 1626.4632 1633.7313 2190.1404 2969.1075 2973.3613 2973.4989 2979.3884 2986.7079 2996.3892 3032.9195 3041.2118 3045.2852 3051.2740 3056.3208 3062.2569 3080.0876 3109.2149 3122.9858 3137.0338 3189.5931 3491.2798 3515.9172
redmass: 5.3120 4.5030 1.7062 1.7302 4.5234 5.8799 4.1350 7.7661 3.6920 4.5443 4.8135 4.9813 3.3974 3.1689 3.9115 5.1747 2.4324 3.0332 4.5654 3.6056 2.3657 2.9275 1.6571 3.6096 2.4880 4.2439 2.5215 3.6907 6.6369 5.5888 6.8652 3.6608 4.7098 2.9493 1.4736 3.2021 2.7041 3.1602 1.4824 2.6867 2.7162 1.2990 2.5860 1.6987 2.0174 1.3577 2.4582 2.6517 1.3535 1.8765 2.9324 2.3898 2.3166 1.5363 1.4119 3.3131 2.3263 2.3204 1.3018 2.2016 2.2570 1.1230 1.4830 2.6010 1.3282 1.3731 1.2478 2.4372 1.2239 1.2593 1.2951 1.3436 1.3682 1.3821 1.4207 1.5112 1.4986 5.2710 1.2362 3.5580 1.0873 1.0856 1.0823 1.0492 1.1281 1.0922 2.0558 2.7331 4.8770 7.1572 7.6848 12.5641 1.0654 1.0628 1.0397 1.0613 1.0771 1.0661 1.0847 1.0951 1.0996 1.0973 1.0995 1.1028 1.0988 1.0876 1.0908 1.0964 1.0943 1.0753 1.0683
irintensity: 1.8849 1.1153 0.6593 0.7149 0.1644 5.7514 0.2432 2.6116 2.4618 4.4655 3.3159 3.5488 4.9341 2.6958 2.1722 10.6524 1.4949 5.9810 1.9150 1.4804 5.8766 0.0231 147.6336 1.6713 2.3662 6.9814 30.9037 3.4714 2.2502 14.0078 0.0741 8.9853 12.3051 2.8874 70.8442 11.4033 2.1844 20.0001 75.9735 3.3099 4.9200 19.6034 9.2191 6.1657 14.5095 4.4614 5.2315 12.6404 3.6550 6.2641 2.7036 4.0680 1.0991 12.2534 3.1201 15.2639 10.0812 78.7427 17.1505 8.9600 179.9349 7.0040 23.4240 0.2412 0.5938 5.0053 42.1669 3.9258 18.4123 10.9065 4.6995 7.0193 17.0660 3.7534 0.1036 7.6361 0.8270 99.3897 1.5304 40.1839 6.1650 10.4607 19.1221 13.7637 59.3593 4.8755 34.0434 691.0832 55.4525 178.1047 59.2889 10.5434 22.3398 55.8017 27.8164 34.9228 3.8733 16.5130 14.1039 55.6685 46.1874 23.3890 8.9542 57.0176 20.7652 19.9558 24.8180 19.6507 3.1926 45.8334 23.8185
temp: 298.150 k
press: 1.00000 atm
elementType: 8 8 7 7 7 6 6 6 6 6 6 6 6 6 6 6 6 6 6 6 1 1 1 1 1 1 1 1 1 1 1 1 1 1 1 1 1 1 1
symmnumber: 1
zpe: 833789.2 jmol-1
zpe.correction: 0.317574 hartree
zpe.thermalcorrener: 0.337175 hartree
zpe.thermalcorrenthalpy: 0.338119 hartree
zpe.thermalcorrgfe: 0.267891 hartree
zpe.sumelectzpe: -896.180077 hartree
zpe.sumelectthermal: -896.160475 hartree
zpe.sumelectthermalent: -896.159531 hartree
zpe.sumelectthermalfe: -896.229759 hartree
dipole: 3.6074 -3.8579 2.6549
dipole: 5.9114
quadrupole: -88.2772 -126.7111 -114.1794
quadrupole: -3.6169 -0.1656 -7.3182
quadrupole: 21.4454 -16.9885 -4.4568 -3.6169 -0.1656 -7.3182
hfenergy: -896.4976503 hartree
pointgroup: C01 [X(C15H19N3O2)]
dipole: -1.3091885 1.6285844 1.0211767 debye
polarizability: 279.4710135|-33.4462248|136.5067354|2.6515623|5.9722178|161.6374132 unknown
InChI: InChI=1S/C15H19N3O2/c1-11-6-8-13(9-7-11)17-15(19)18(20)14-5-3-2-4-12(14)10-16/h6-9,12,14,17,20H,2-5H2,1H3
charge 0 multiplicity 1
39 atoms
O  -1.156612 1.348526 1.679373
O  0.055674 0.543503 -1.641615
N  -1.181468 1.275905 0.195613
N  1.07845 0.651304 0.498316
N  -1.258002 -2.481845 0.458071
C  -2.487887 0.802176 -0.324818
C  -3.017345 -0.477371 0.412513
C  -3.549203 1.921552 -0.256512
C  -4.361416 -0.948128 -0.225261
C  -4.894839 1.462885 -0.866666
C  -5.41571 0.179526 -0.179948
C  -2.031844 -1.57383 0.429252
C  0.032195 0.767541 -0.395864
C  2.431196 0.312034 0.215987
C  3.327667 0.235241 1.312865
C  2.91389 0.056708 -1.094786
C  5.18608 -0.345636 -0.197016
C  4.683621 -0.089439 1.103385
C  4.273654 -0.263615 -1.280831
C  6.643357 -0.70981 -0.424679
H  -2.277392 0.549824 -1.380955
H  -3.203724 -0.191329 1.46818
H  -3.159476 2.807145 -0.790709
H  -3.7068 2.212947 0.802922
H  -4.725119 -1.843509 0.311025
H  -4.175308 -1.250707 -1.274025
H  -4.757419 1.269791 -1.949956
H  -5.640392 2.275285 -0.778593
H  -5.671273 0.403089 0.876311
H  -6.346463 -0.165001 -0.668448
H  -1.226286 2.323445 1.863132
H  0.814843 0.772225 1.481614
H  2.964013 0.425337 2.331031
H  2.223745 0.102501 -1.93937
H  5.359522 -0.146339 1.965056
H  4.633029 -0.460688 -2.298702
H  7.109986 -0.056963 -1.185896
H  7.232423 -0.618692 0.504448
H  6.74633 -1.751687 -0.784247
