program: Gaussian 09
title: 000268140
version: EM64L-G09RevD.01
frameworkgroup: C1[X(C20H20O6)]
method: RPBEPBE
basis: SDD
operation: Freq
keyword: #pfreq=noraman
keyword: PBEPBE/SDD
title: #p freq=noraman PBEPBE/SDD
converged: YES YES NO NO
title: Mulliken charges:
elementType: O O O O O O C C C C C C C C C C C C C C C C C C C C H H H H H H H H H H H H H H H H H H H H
charge: -0.285859 -0.302010 -0.260283 -0.247573 -0.447643 -0.239946 -0.201202 -0.021416 0.199250 -0.740546 -0.710354 0.310169 0.208011 -0.320520 -0.357101 0.134160 -0.349177 -0.373584 0.326526 0.249529 -0.351917 -0.364895 -0.226127 -0.219882 0.077270 -0.536592 0.208461 0.255972 0.223262 0.235997 0.274070 0.238885 0.249276 0.209246 0.290738 0.225359 0.262407 0.247137 0.270842 0.262475 0.236080 0.235423 0.228063 0.254780 0.228366 0.414875
chargesum: 0.00000
title: Mulliken charges with hydrogens summed into heavy atoms:
elementType: O O O O O O C C C C C C C C C C C C C C C C C C C C
charge: -0.285859 -0.302010 -0.260283 -0.247573 -0.032767 -0.239946 0.007259 0.234556 0.199250 -0.007217 -0.012947 0.310169 0.208011 -0.029782 -0.131743 0.134160 -0.086771 -0.126447 0.326526 0.249529 -0.081075 -0.102420 0.009953 0.015541 0.077270 0.174616
polarizability: 3.94558435e+02 1.32797841e+00 2.25957247e+02 1.42653743e+01 -2.81597486e+00 1.43328032e+02
1716.lowfreq: -6.4721 -2.5825 -0.0010 -0.0008 -0.0006 8.0611 13.3905 31.9883 36.5461
frequency: 12.7526 31.9265 36.5227 43.5861 62.7452 77.7851 86.3495 102.9521 114.3627 134.4559 143.4153 152.9831 167.4674 174.8860 208.8681 216.4726 218.9619 222.4576 226.9413 235.3592 259.0839 271.4029 298.7194 309.3648 327.1409 361.8929 368.9329 395.2003 412.2707 414.7367 447.1775 464.0963 481.1863 502.4089 513.5653 518.9288 564.4428 607.2316 627.7987 631.0773 651.4789 671.7712 683.0803 704.4645 725.1175 754.7881 771.5488 773.2612 783.4271 789.6250 809.0071 810.8219 818.8927 860.9851 867.0162 890.3903 903.5957 944.7836 957.9557 976.5869 980.4628 983.0790 998.2831 1002.9414 1003.7809 1023.0953 1031.3025 1039.4803 1042.1366 1089.8880 1093.3127 1106.3071 1110.0273 1119.8596 1146.2756 1148.0279 1156.0592 1175.2395 1183.7270 1220.8239 1238.8977 1245.1287 1249.2024 1262.5282 1276.8984 1293.3374 1309.9872 1327.1963 1364.6453 1379.9989 1380.5895 1397.8452 1399.6776 1406.2538 1434.2905 1434.9242 1437.2408 1458.5630 1468.6972 1470.6759 1472.9099 1475.0474 1478.6962 1494.3942 1499.3263 1529.8835 1572.7681 1574.9040 1602.8875 1612.1942 1619.0092 1619.3513 2894.2525 2971.3585 2995.3783 2997.8325 3009.0859 3021.1645 3064.9242 3092.3607 3092.6879 3103.2442 3112.9282 3135.0955 3136.7131 3145.0412 3149.0693 3160.1277 3161.2524 3170.0897 3172.0022 3179.1941
redmass: 5.9656 3.7157 8.5245 5.3905 4.3419 4.6831 5.1646 6.1355 5.3801 4.9668 3.8319 7.3636 4.3093 5.9097 1.1830 1.6996 2.2423 1.4131 1.7589 3.9430 3.3901 5.2903 5.0372 4.5504 6.2134 5.5604 3.9204 6.4803 2.9966 4.1640 5.1065 4.1373 5.1727 3.6546 4.3169 3.2076 4.3098 5.3206 6.6819 6.6489 6.7015 5.4167 3.9169 4.3226 3.4901 6.1457 4.0601 4.6792 2.5853 1.8287 2.3063 2.2150 2.4055 1.7507 2.8886 1.2022 1.4670 1.4262 3.9280 1.4027 7.8141 1.4414 2.1804 1.3510 1.4534 4.6137 2.6788 2.6644 1.6837 2.7165 2.4303 2.0992 1.2597 1.3383 2.1379 2.1650 1.3157 1.0615 1.3099 2.3219 2.7381 2.8158 2.0949 1.5916 1.4926 1.4892 1.2859 1.4093 1.9627 8.8658 2.6821 1.4317 1.2535 1.2631 2.0229 1.5842 2.5301 1.0522 1.0544 1.0844 1.2219 1.8724 1.0731 1.1173 2.3488 6.3044 7.1133 6.9869 7.3131 8.6819 6.6533 8.4764 1.0710 1.0325 1.0364 1.0372 1.0812 1.0843 1.1045 1.0998 1.0990 1.1008 1.1001 1.0859 1.1001 1.0875 1.0901 1.0882 1.0948 1.0950 1.1006 1.0976
irintensity: 1.0088 0.5639 3.8133 0.2052 1.7561 1.7265 0.8158 1.2853 0.1011 3.6552 1.1394 5.2138 7.4685 15.3453 0.9479 0.9345 3.8119 0.1645 0.0334 3.3957 11.6320 6.6984 5.6982 9.1887 3.7076 36.0092 4.0201 0.9846 0.3094 0.8840 7.6252 8.1737 5.8399 11.7042 1.2536 27.7947 9.2467 59.9407 8.2267 4.4829 7.2513 8.5690 5.2551 37.5980 3.0666 9.2523 19.7556 12.2805 31.0723 44.8813 14.8986 32.2994 4.8087 53.7051 9.7766 421.2934 3.1201 4.8125 129.0343 3.3164 32.4368 35.0384 0.9922 1.9968 1.2077 284.7739 18.7687 7.6489 25.5557 249.6153 25.0140 60.5215 0.1322 15.9210 45.2585 5.9906 12.3897 4.1138 289.9702 67.2550 711.5889 69.5375 65.4502 37.6302 15.9998 38.3743 24.4307 15.3588 0.3036 6.4911 3.9555 95.4111 21.6411 20.8235 14.7985 25.6459 33.1492 19.6993 18.6582 37.3205 11.4982 21.8588 23.3063 44.8060 13.3575 394.6127 8.2977 44.2827 130.8801 295.0595 207.2284 20.6942 2343.9715 53.0535 14.8341 29.0805 1.3140 32.5353 38.8950 8.0661 49.2780 22.9653 1.5917 2.0829 22.4333 10.2331 7.1314 0.1418 6.9991 9.6924 26.1161 4.9583
temp: 298.150 k
press: 1.00000 atm
elementType: 8 8 8 8 8 8 6 6 6 6 6 6 6 6 6 6 6 6 6 6 6 6 6 6 6 6 1 1 1 1 1 1 1 1 1 1 1 1 1 1 1 1 1 1 1 1
symmnumber: 1
zpe: 937886.4 jmol-1
zpe.correction: 0.357222 hartree
zpe.thermalcorrener: 0.381855 hartree
zpe.thermalcorrenthalpy: 0.382799 hartree
zpe.thermalcorrgfe: 0.301615 hartree
zpe.sumelectzpe: -1223.596600 hartree
zpe.sumelectthermal: -1223.571967 hartree
zpe.sumelectthermalent: -1223.571022 hartree
zpe.sumelectthermalfe: -1223.652206 hartree
dipole: -6.4265 -4.1222 -1.7917
dipole: 7.8423
quadrupole: -96.6080 -155.8313 -155.4987
quadrupole: 15.6000 0.6781 3.5475
quadrupole: 39.3713 -19.8520 -19.5193 15.6000 0.6781 3.5475
hfenergy: -1223.9538217 hartree
pointgroup: C01 [X(C20H20O6)]
dipole: -2.5730749 -1.2753792 -1.1280056 debye
polarizability: 391.8617128|-13.4050203|224.6711358|25.6148059|12.1965426|147.310866 unknown
InChI: InChI=1S/C20H20O6/c1-12(18(21)14-8-10-15(25-3)11-9-14)13(2)26-20(24)17-7-5-4-6-16(17)19(22)23/h4-13,22H,1-3H3
charge 0 multiplicity 1
46 atoms
O  1.343977 -0.848448 -0.399174
O  -0.772815 0.669011 1.605777
O  2.572044 -2.821292 -0.14565
O  -6.693949 1.377558 -0.605415
O  1.804531 0.694941 1.834555
O  1.964196 2.445672 0.304063
C  -0.809527 -1.596236 0.674682
C  0.084951 -1.623139 -0.613958
C  -1.432703 -0.219472 0.963913
C  -0.046318 -2.139857 1.907897
C  -0.558814 -1.033201 -1.873117
C  -2.814577 0.11317 0.524436
C  2.524556 -1.565798 -0.160116
C  -3.270677 1.45655 0.708912
C  -3.710778 -0.823952 -0.05902
C  3.719176 -0.671676 -0.034633
C  -4.556104 1.844594 0.322991
C  -5.011881 -0.450624 -0.446954
C  -5.437719 0.89096 -0.258503
C  3.664723 0.702896 0.340442
C  4.967642 -1.25044 -0.382777
C  4.845721 1.480306 0.299962
C  6.144317 -0.475175 -0.387837
C  6.080961 0.898976 -0.058596
C  2.394866 1.372363 0.795377
C  -7.654359 0.449171 -1.218305
H  -1.626726 -2.303989 0.439438
H  0.379612 -2.678971 -0.770736
H  -0.725306 -2.242202 2.77292
H  0.381979 -3.13119 1.679454
H  0.778614 -1.468509 2.194267
H  0.10185 -1.190898 -2.742208
H  -0.729437 0.051286 -1.764948
H  -1.528173 -1.521044 -2.081006
H  -2.579055 2.175869 1.15766
H  -3.410499 -1.866042 -0.206176
H  -4.90945 2.871358 0.454295
H  -5.678875 -1.198201 -0.885306
H  4.987969 -2.310022 -0.657067
H  4.784264 2.540759 0.564341
H  7.100775 -0.934733 -0.658305
H  6.988529 1.5121 -0.074499
H  -7.898276 -0.382149 -0.530294
H  -8.552803 1.053639 -1.406048
H  -7.265339 0.048075 -2.173177
H  0.78421 0.826506 1.872236
