program: Gaussian 09
title: 000268079
version: EM64L-G09RevD.01
frameworkgroup: C1[X(C20H28N6O2)]
method: RPBEPBE
basis: SDD
operation: Freq
keyword: #p
keyword: freq=noraman
keyword: PBEPBE/SDD
title: #p freq=noraman PBEPBE/SDD
converged: YES YES NO NO
title: Mulliken charges:
elementType: O O N N N N N N C C C C C C C C C C C C C C C C C C C C H H H H H H H H H H H H H H H H H H H H H H H H H H H H
charge: -0.348731 -0.352706 -0.284982 -0.287372 -0.386222 -0.384057 -0.685192 -0.685061 -0.376506 -0.374505 -0.351022 -0.346547 -0.385967 -0.389943 0.216977 0.209928 0.135832 0.138780 0.313221 0.312787 -0.315602 -0.316130 -0.396656 -0.396251 -0.300865 -0.300368 -0.201288 -0.201156 0.202310 0.202868 0.191771 0.210516 0.175373 0.250177 0.194759 0.225240 0.237103 0.247276 0.266935 0.199681 0.237979 0.231913 0.298407 0.298795 0.190944 0.192479 0.216856 0.216924 0.226181 0.226462 0.224239 0.224323 0.380381 0.294697 0.380089 0.294928
chargesum: 0.00000
title: Mulliken charges with hydrogens summed into heavy atoms:
elementType: O O N N N N N N C C C C C C C C C C C C C C C C C C C C
charge: -0.348731 -0.352706 -0.047880 -0.040097 -0.087815 -0.085263 -0.010114 -0.010044 0.028672 0.027781 0.074529 0.073452 0.080649 0.079948 0.216977 0.209928 0.135832 0.138780 0.313221 0.312787 -0.124658 -0.123650 -0.179800 -0.179327 -0.074684 -0.073906 0.022951 0.023166
polarizability: 4.04113481e+02 -3.02994503e+00 2.76793242e+02 -4.79897760e+01 -4.14396710e-01 1.65911281e+02
1716.lowfreq: -7.9842 -2.3742 -1.4474 -0.0014 0.0005 0.0007 8.6968 11.2102 13.5383
frequency: 7.2709 10.9624 13.3233 17.1270 25.1696 37.0852 41.7809 49.6078 55.5785 72.5715 77.7429 111.1233 122.2916 132.1872 136.9083 139.4914 149.4701 166.3498 185.0296 216.5831 231.7428 247.7316 266.1089 287.3620 336.6763 353.8279 354.6279 386.7078 401.9400 403.8714 417.6887 423.0223 426.0925 452.1776 453.2963 470.5498 478.5398 504.7489 511.4130 521.6048 528.6667 540.6827 554.4938 554.7121 569.5305 653.2856 654.4243 676.4054 680.3733 681.9072 704.8233 743.9344 743.9920 751.6906 752.6556 753.9191 756.0232 799.6564 804.9251 809.7390 818.8979 823.6909 842.4740 842.7849 854.5165 856.7018 924.8273 925.1794 970.5381 970.6078 978.2820 992.1087 1009.4091 1017.8472 1029.0108 1032.2317 1038.5579 1053.8820 1059.9147 1062.2061 1065.6796 1092.5145 1095.7505 1135.9349 1137.7707 1145.6234 1155.9297 1162.9190 1164.2746 1166.2340 1177.8300 1178.6809 1178.8600 1229.0554 1239.8659 1271.1618 1276.3536 1277.8524 1284.5349 1289.1418 1290.4583 1295.2790 1298.5836 1314.9702 1334.1147 1335.1627 1340.7712 1364.4382 1381.9766 1398.6299 1402.5122 1402.8553 1430.3049 1430.4751 1450.0622 1450.4199 1453.8274 1465.8058 1475.7503 1476.3388 1479.6308 1485.9230 1494.4530 1498.0274 1504.8137 1505.6616 1524.9536 1525.7236 1577.0093 1577.5750 1603.8781 1607.7531 1633.1242 1633.3475 2856.7329 2889.2893 2899.0850 2906.7088 2979.1800 2995.4975 3003.9619 3006.3388 3014.5526 3042.7002 3082.2470 3096.3214 3113.8253 3114.5447 3119.2045 3119.5423 3141.5150 3141.6607 3166.0602 3166.0792 3336.9308 3340.2299 3418.3633 3422.5070 3579.1947 3580.6967 3640.1312 3640.9108
redmass: 5.7583 4.7788 5.4982 4.9621 5.9055 2.9464 4.4526 5.1483 2.7321 4.4745 3.5942 2.7489 2.8753 3.2332 3.2842 5.0611 2.5914 3.6210 3.8014 3.2876 4.0624 4.2239 3.6969 3.7207 3.7649 4.6062 4.4415 3.5441 7.4282 6.6978 2.3924 2.2503 3.4551 1.3626 1.3622 3.2502 2.8177 1.4783 1.7170 2.3774 2.3064 3.4427 5.5329 5.8598 4.3455 4.9400 5.3411 1.4924 3.9829 2.9466 1.2993 1.6750 1.6453 1.7808 1.7583 1.7129 1.8749 1.4217 1.3703 1.3115 2.5531 2.1291 1.5601 1.5566 2.9416 2.8234 1.3915 1.3903 1.3263 1.3350 4.0423 4.9958 3.2940 3.4485 2.3028 2.2179 2.5063 3.6073 1.7706 1.7475 1.7583 2.9293 1.5225 2.0782 2.1079 3.1116 4.0519 1.5468 1.4760 1.9924 1.3872 1.1248 1.1144 1.4763 1.3224 1.1838 1.7434 1.8476 1.4314 1.7268 1.7118 1.1863 1.1745 1.2823 1.7652 1.8534 1.3526 1.3484 1.3787 1.5118 5.9080 4.9881 1.9594 1.9526 1.4489 1.4290 1.2321 1.2270 1.9044 1.8242 1.1446 1.1097 1.0882 1.0877 1.9394 1.9416 3.5765 3.5891 6.4569 6.6064 1.5318 1.5240 6.7517 6.7712 1.0714 1.0688 1.0681 1.0664 1.0888 1.0664 1.0917 1.0948 1.0589 1.0864 1.1055 1.0986 1.0865 1.0863 1.0877 1.0878 1.0936 1.0936 1.0998 1.0997 1.0597 1.0595 1.0737 1.0738 1.0770 1.0770 1.0914 1.0915
irintensity: 0.0660 0.0962 0.2776 0.4511 0.0361 3.2062 4.5905 0.1868 3.0778 3.8240 0.2171 2.9794 3.8964 0.3590 1.8416 0.7661 4.9847 1.9118 4.3429 0.9705 4.8199 0.7498 0.2128 2.6396 3.8201 16.4881 17.2250 0.2322 3.2024 1.1874 47.2050 1.6338 3.5691 138.3555 105.1070 0.2583 6.8252 42.3741 28.3115 107.3668 2.8274 132.8534 4.0833 4.7700 3.5929 9.4859 4.1064 81.4516 24.6818 8.1743 93.2285 47.6398 49.9559 3.0910 0.5233 106.3585 97.4297 83.3163 92.1210 3.9692 0.9081 10.4971 2.2077 1.6794 7.7371 1.3958 1.2184 1.2631 0.3836 0.2869 14.1203 2.7837 2.9033 0.8267 8.1912 2.9250 7.7001 9.2057 7.6538 1.5292 6.0864 3.9664 51.6975 5.4465 29.0027 2.6550 177.5764 16.8577 36.3523 25.5318 34.2002 13.1203 4.3541 4.3392 2.9385 14.6955 208.6040 18.6398 7.5336 30.7536 197.1986 6.7144 71.1519 5.4770 2.2909 2.6747 28.8015 4.9945 7.4832 1.3546 21.5435 11.8135 21.2067 47.3958 15.2235 5.5053 8.1878 45.9918 52.9153 63.3463 1.2915 31.1782 0.1813 4.9960 461.6507 162.7712 131.7897 335.0220 68.3178 85.3790 91.2919 92.6746 150.4302 215.6469 110.0019 22.7627 48.2252 183.3673 4.3803 49.0736 16.3589 85.5519 46.8440 19.0176 15.8884 7.8280 19.9662 19.5203 5.0255 4.8251 33.6258 33.5579 30.8521 18.4648 193.2576 175.4950 0.9419 2.1027 13.8154 13.4384 53.1651 54.2715
temp: 298.150 k
press: 1.00000 atm
elementType: 8 8 7 7 7 7 7 7 6 6 6 6 6 6 6 6 6 6 6 6 6 6 6 6 6 6 6 6 1 1 1 1 1 1 1 1 1 1 1 1 1 1 1 1 1 1 1 1 1 1 1 1 1 1 1 1
symmnumber: 1
zpe: 1223190.5 jmol-1
zpe.correction: 0.465889 hartree
zpe.thermalcorrener: 0.494443 hartree
zpe.thermalcorrenthalpy: 0.495387 hartree
zpe.thermalcorrgfe: 0.399279 hartree
zpe.sumelectzpe: -1255.826440 hartree
zpe.sumelectthermal: -1255.797886 hartree
zpe.sumelectthermalent: -1255.796942 hartree
zpe.sumelectthermalfe: -1255.893050 hartree
dipole: -0.1474 -3.0566 0.0495
dipole: 3.0606
quadrupole: -137.4645 -142.0344 -174.3293
quadrupole: 1.5055 -16.4917 2.4589
quadrupole: 13.8116 9.2417 -23.0532 1.5055 -16.4917 2.4589
hfenergy: -1256.292329 hartree
pointgroup: C01 [X(C20H28N6O2)]
dipole: -0.0545444 -0.0802857 1.2002085 debye
polarizability: 402.9614001|-50.8378545|167.7569147|-1.5516588|-8.6138932|276.0996901 unknown
InChI: InChI=1S/C20H28N6O2/c21-17-7-3-1-5-15(17)19(27)25-13-11-23-9-10-24-12-14-26-20(28)16-6-2-4-8-18(16)22/h1-8,23-26H,9-14,21-22H2
charge 0 multiplicity 1
56 atoms
O  -5.465606 -0.561044 -1.293287
O  5.580684 0.709648 -1.413304
N  -1.791405 -0.67498 1.288143
N  1.740256 0.63105 0.901622
N  -5.568977 -0.865641 0.993409
N  5.526064 0.792642 0.894656
N  -7.445747 0.656064 -2.534748
N  7.621007 -0.449555 -2.617853
C  -0.71318 0.320623 1.106717
C  0.664941 -0.368408 1.088425
C  -3.164909 -0.150403 1.166876
C  3.113399 0.088291 0.948911
C  -4.171668 -1.321075 1.057084
C  4.130454 1.253777 0.908502
C  -6.16192 -0.512928 -0.209276
C  6.198649 0.547954 -0.292847
C  -7.590359 -0.080843 -0.188645
C  7.617815 0.093386 -0.215233
C  -8.171479 0.519158 -1.369693
C  8.269178 -0.419376 -1.400516
C  -8.413052 -0.241969 0.963003
C  8.363102 0.147335 0.997364
C  -9.527197 0.978884 -1.308976
C  9.611995 -0.906393 -1.288443
C  -9.746422 0.198609 1.0024
C  9.685681 -0.317588 1.088115
C  -10.296081 0.824966 -0.148287
C  10.303179 -0.859614 -0.07097
H  -0.882953 0.822865 0.13253
H  -0.699929 1.120614 1.885492
H  0.838453 -0.873107 2.061684
H  0.651805 -1.165419 0.307629
H  -3.465585 0.522118 2.010109
H  -3.231414 0.444125 0.237679
H  3.228368 -0.474295 1.896857
H  3.348516 -0.616221 0.115989
H  -1.663451 -1.211178 2.158527
H  1.591495 1.173841 0.037943
H  -3.945558 -1.888279 0.139937
H  -4.064547 -2.0015 1.924676
H  3.972111 1.841517 -0.013331
H  3.965277 1.914882 1.77791
H  -6.071086 -0.708061 1.865714
H  5.96684 0.552435 1.781375
H  -8.01772 -0.754329 1.849007
H  7.915128 0.594472 1.893583
H  -9.962561 1.448455 -2.199756
H  10.100346 -1.310356 -2.183886
H  -10.353677 0.05294 1.900938
H  10.233552 -0.254392 2.03319
H  -11.332798 1.180614 -0.135691
H  11.332285 -1.233338 -0.019144
H  -6.498374 0.248473 -2.542786
H  -7.862406 1.093698 -3.352259
H  6.682115 -0.024961 -2.655507
H  8.084563 -0.829884 -3.438758
