program: Gaussian 09
title: 000268028
version: EM64L-G09RevD.01
frameworkgroup: C1[X(C13H13NO)]
method: RPBEPBE
basis: SDD
operation: Freq
keyword: #p
keyword: freq=noraman
keyword: PBEPBE/SDD
title: #p freq=noraman PBEPBE/SDD
converged: YES YES NO NO
title: Mulliken charges:
elementType: O N C C C C C C C C C C C C C H H H H H H H H H H H H H
charge: -0.276102 -0.396869 -0.571657 -0.567826 0.450745 0.510699 -0.399421 -0.397848 -0.411133 0.061683 -0.142084 -0.228015 -0.224426 -0.295623 -0.239707 0.238274 0.249132 0.217345 0.232250 0.324608 0.240499 0.231793 0.230544 0.231231 0.226561 0.227312 0.247352 0.230681
chargesum: 0.00000
title: Mulliken charges with hydrogens summed into heavy atoms:
elementType: O N C C C C C C C C C C C C C
charge: -0.276102 -0.072261 -0.084251 -0.118231 0.450745 0.510699 -0.158922 -0.166055 -0.180589 0.061683 0.089147 -0.001455 0.002887 -0.048272 -0.009025
polarizability: 2.13438958e+02 -4.34936684e+00 1.57663826e+02 -1.68213310e+01 -2.96994714e+00 7.34345756e+01
1716.lowfreq: -13.8844 -6.4681 -0.0004 0.0005 0.0006 5.8871 17.0158 29.0756 53.7328
frequency: 7.3516 28.6367 53.5726 59.2957 109.7021 178.0336 224.6344 272.9458 293.4780 344.9642 402.7418 424.0737 465.5504 491.1683 517.3971 529.2647 579.8699 617.3626 639.2595 703.4058 706.0053 732.1240 754.3120 761.6121 780.4290 794.3910 825.9772 853.7942 859.2361 906.7196 922.7916 976.3332 983.3924 984.9677 989.9530 991.3136 996.7723 1001.1551 1026.1943 1056.1179 1084.4513 1144.6080 1152.2348 1173.1512 1187.0642 1206.7593 1216.9020 1230.8299 1268.3382 1274.6824 1323.6002 1328.8340 1342.7064 1382.4454 1397.2827 1435.9748 1440.7993 1469.8526 1483.6249 1484.1870 1548.9789 1593.5848 1605.2084 1614.0475 1657.8898 2987.2059 2996.6265 3046.8956 3075.6063 3113.5742 3115.2420 3133.1139 3135.6362 3145.2630 3164.1010 3177.4465 3186.8721 3496.5456
redmass: 4.1559 4.3625 3.6605 3.8925 5.6324 5.5757 4.6783 3.1483 2.9480 2.7788 2.8117 2.9951 4.1714 3.3511 5.9172 7.7954 3.8679 6.3614 4.2510 2.1512 1.8157 3.4575 1.3330 2.1339 1.2469 1.8569 3.4368 1.2489 1.4879 2.1924 1.8989 1.3934 1.3092 2.6131 6.2267 3.0831 1.5942 2.4297 2.1877 1.8885 1.5286 1.1957 1.2714 1.0519 1.1132 1.9667 2.5295 2.2697 1.2193 1.4029 1.3435 1.2977 1.3134 7.7976 2.3017 3.0919 2.1705 1.1353 1.8167 1.2501 6.9776 6.0370 4.3205 6.1644 6.8293 1.0633 1.0613 1.0996 1.1007 1.0882 1.0871 1.0901 1.0891 1.0956 1.1014 1.0931 1.0972 1.0768
irintensity: 0.8116 1.0813 0.2551 1.0129 0.4922 3.5662 0.0165 3.1858 1.5944 0.1197 0.0043 7.9098 4.2091 22.3936 1.7026 4.7714 1.9847 0.0377 4.4962 0.9658 94.3983 2.8668 8.0805 21.1600 14.1637 118.0415 4.2371 0.0419 0.3788 5.9212 3.6314 0.0618 0.5335 7.3332 0.2928 1.7751 2.1670 8.2676 6.7215 7.9591 8.9003 1.6764 29.7091 0.1044 0.1109 6.4037 0.0998 7.2762 0.6066 7.3895 0.9601 0.1734 0.5399 0.0120 7.9047 7.4833 7.6394 1.2803 25.4246 9.8952 27.9053 1.7433 278.3423 6.9896 382.2829 4.3232 42.2978 4.6944 18.9370 8.6681 12.4885 7.1837 19.7389 39.4578 24.1865 6.6718 4.2527 25.2833
temp: 298.150 k
press: 1.00000 atm
elementType: 8 7 6 6 6 6 6 6 6 6 6 6 6 6 6 1 1 1 1 1 1 1 1 1 1 1 1 1
symmnumber: 1
zpe: 596149.8 jmol-1
zpe.correction: 0.227061 hartree
zpe.thermalcorrener: 0.239950 hartree
zpe.thermalcorrenthalpy: 0.240894 hartree
zpe.thermalcorrgfe: 0.184026 hartree
zpe.sumelectzpe: -632.106975 hartree
zpe.sumelectthermal: -632.094087 hartree
zpe.sumelectthermalent: -632.093142 hartree
zpe.sumelectthermalfe: -632.150010 hartree
dipole: 4.0866 -3.3155 -0.6917
dipole: 5.3077
quadrupole: -99.0981 -85.7322 -93.0056
quadrupole: 16.8283 -1.2341 -2.5789
quadrupole: -6.4861 6.8798 -0.3936 16.8283 -1.2341 -2.5789
hfenergy: -632.3340362 hartree
pointgroup: C01 [X(C13H13N1O1)]
dipole: 1.6126922 1.2770623 0.3590284 debye
polarizability: 213.0989368|3.0498963|157.6959291|18.5480585|1.4687406|73.7424943 unknown
InChI: InChI=1S/C13H13NO/c15-13-8-4-7-12(14-13)10-9-11-5-2-1-3-6-11/h1-8,14H,9-10H2
charge 0 multiplicity 1
28 atoms
O  -4.168313 -2.038306 -0.350905
N  -2.275774 -0.752736 0.143886
C  -0.104397 0.332846 0.634114
C  0.722871 0.049716 -0.666479
C  -1.592039 0.432155 0.374912
C  2.21159 -0.0509 -0.370156
C  -2.30279 1.627028 0.316835
C  3.016487 1.116187 -0.307254
C  2.818453 -1.306243 -0.109155
C  -3.672424 -0.882688 -0.161966
C  -3.708212 1.593398 0.018996
C  4.390594 1.032569 0.010772
C  4.192747 -1.395386 0.208797
C  -4.371953 0.395671 -0.213323
C  4.983496 -0.224799 0.271566
H  0.107811 -0.468579 1.369746
H  0.249588 1.277321 1.081647
H  0.359746 -0.886931 -1.131134
H  0.522309 0.864341 -1.387302
H  -1.774605 -1.646812 0.192397
H  -1.785421 2.571505 0.50004
H  2.566168 2.094775 -0.517894
H  2.213637 -2.220457 -0.164391
H  -4.265023 2.536682 -0.023997
H  4.998727 1.943444 0.049656
H  4.646488 -2.374021 0.401942
H  -5.440487 0.355694 -0.440268
H  6.049524 -0.291773 0.515522
