program: Gaussian 09
title: 000268019
version: EM64L-G09RevD.01
frameworkgroup: C1[X(C10H20O)]
method: RPBEPBE
basis: SDD
operation: Freq
keyword: #pfreq=noraman
keyword: PBEPBE/SDD
title: #p freq=noraman PBEPBE/SDD
converged: YES YES NO NO
title: Mulliken charges:
elementType: O C C C C C C C C C C H H H H H H H H H H H H H H H H H H H H
charge: -0.452733 -0.363795 -0.376942 -0.376422 -0.363692 -0.455697 -0.341424 -0.187059 -0.181818 -0.436365 -0.670574 0.195703 0.191071 0.187915 0.190467 0.192642 0.209266 0.213293 0.213655 0.195781 0.205000 0.187231 0.186923 0.223137 0.219726 0.202587 0.206206 0.340206 0.221417 0.214183 0.210114
chargesum: 0.00000
title: Mulliken charges with hydrogens summed into heavy atoms:
elementType: O C C C C C C C C C C
charge: -0.112527 0.022979 0.001440 0.025486 0.063255 -0.054916 0.032729 0.036078 0.037908 -0.027572 -0.024861
polarizability: 1.59493508e+02 -5.75068397e+00 9.42012868e+01 5.38684121e+00 4.11188372e-01 9.41512995e+01
1716.lowfreq: -0.0003 0.0003 0.0008 3.3609 6.8482 15.6120 27.7893 34.7038 55.8163
frequency: 27.7576 34.5308 55.7151 66.0581 86.7346 112.7910 118.3036 134.8617 143.7887 196.2842 209.5213 228.6926 267.8600 272.2411 373.0851 397.8367 420.5690 486.1540 520.5263 728.1462 752.5640 771.8492 791.6375 817.5316 866.5864 900.4191 955.4563 967.3371 976.5958 987.2324 997.9281 1020.8040 1046.4473 1062.1745 1067.6396 1070.0577 1079.2307 1109.6600 1148.9578 1168.5220 1198.2935 1215.0370 1231.7414 1242.6514 1259.3531 1270.6537 1278.1917 1285.6563 1289.5005 1294.3915 1296.8089 1315.2782 1337.1171 1347.5819 1357.7948 1384.2611 1412.9896 1456.8407 1462.8035 1463.7523 1467.5514 1472.1557 1474.8466 1481.0955 1484.6630 1489.4599 1685.9509 2924.7069 2947.3672 2951.5710 2955.9391 2961.6524 2966.1091 2972.2447 2976.1502 2989.1954 2990.9030 3001.8774 3015.5950 3022.5871 3039.4832 3058.4650 3059.8781 3068.0964 3073.7450 3081.6397 3564.9489
redmass: 3.8300 2.4310 2.4985 2.8097 2.2853 2.2650 2.5171 2.3450 1.9775 2.0082 1.7132 4.0423 1.9326 1.0859 2.6730 3.9741 2.5611 3.1371 2.6068 1.0755 1.1200 1.2403 1.2436 1.4832 1.4042 1.5371 3.3606 1.7860 1.1671 3.2081 2.1534 2.8580 1.7599 2.3084 1.7773 2.6140 2.1582 2.2808 1.4124 1.8459 1.2244 1.4392 1.3082 1.2368 1.2346 1.2681 1.1104 1.1230 1.2028 1.1730 1.2104 1.3689 1.4241 1.5423 1.6285 1.2015 1.4423 1.0841 1.0744 1.0750 1.0737 1.0912 1.0432 1.0935 1.0626 1.0956 6.5987 1.0545 1.0616 1.0592 1.0595 1.0619 1.0605 1.1067 1.0354 1.0969 1.0597 1.0973 1.1019 1.0969 1.1039 1.1033 1.0956 1.0915 1.0960 1.1005 1.0664
irintensity: 0.0519 4.1895 1.8221 0.8881 2.6870 2.8273 1.6398 0.6159 1.8281 1.0482 0.9323 1.1144 0.9121 156.9071 7.4163 6.8837 0.6338 9.3841 0.2696 9.7848 1.0194 7.3120 1.3682 2.3574 0.6379 7.8271 45.0419 25.6595 37.2242 21.4254 15.9569 15.0412 21.8544 0.8126 2.3244 2.8698 0.1727 1.0454 1.0989 1.0483 11.3726 0.1952 19.1780 6.1061 1.8506 16.5451 0.6510 0.8757 0.5382 0.4787 0.2148 4.1644 1.1966 1.1516 0.3078 10.0302 6.0208 2.5277 0.5237 7.0921 1.1609 0.7391 11.1727 7.9089 11.2997 14.3243 0.0855 60.9068 23.8143 2.3872 12.8065 43.4668 100.3191 52.2947 41.1558 0.7768 49.1837 7.6234 1.2153 10.0231 53.2190 88.1333 33.0172 18.8911 115.6899 59.6249 2.0477
temp: 298.150 k
press: 1.00000 atm
elementType: 8 6 6 6 6 6 6 6 6 6 6 1 1 1 1 1 1 1 1 1 1 1 1 1 1 1 1 1 1 1 1
symmnumber: 1
zpe: 729833.7 jmol-1
zpe.correction: 0.277979 hartree
zpe.thermalcorrener: 0.292856 hartree
zpe.thermalcorrenthalpy: 0.293800 hartree
zpe.thermalcorrgfe: 0.234049 hartree
zpe.sumelectzpe: -467.333813 hartree
zpe.sumelectthermal: -467.318936 hartree
zpe.sumelectthermalent: -467.317992 hartree
zpe.sumelectthermalfe: -467.377743 hartree
dipole: -0.2418 1.5662 1.0293
dipole: 1.8897
quadrupole: -69.5665 -71.0718 -69.3411
quadrupole: 9.0706 6.6892 -0.1991
quadrupole: 0.4266 -1.0787 0.6520 9.0706 6.6892 -0.1991
hfenergy: -467.6117918 hartree
pointgroup: C01 [X(C10H20O1)]
dipole: -0.0857041 -0.6165386 -0.4065259 debye
polarizability: 159.196797|6.9897357|94.4377812|-5.7120858|0.2743807|94.2115159 unknown
InChI: InChI=1S/C10H20O/c1-2-3-4-5-6-7-8-9-10-11/h3-4,11H,2,5-10H2,1H3
charge 0 multiplicity 1
31 atoms
O  6.179705 -0.108926 0.258011
C  1.240783 0.604065 0.161435
C  2.40486 -0.301971 -0.29933
C  -0.141487 0.116754 -0.327412
C  3.783133 0.200571 0.187493
C  -1.303309 1.033602 0.141416
C  4.93505 -0.696726 -0.271169
C  -2.651187 0.608736 -0.403397
C  -3.731924 0.267447 0.346668
C  -5.076939 -0.167815 -0.199485
C  -5.487107 -1.583095 0.284694
H  1.238784 0.662685 1.269806
H  1.414864 1.63782 -0.203775
H  2.400775 -0.363218 -1.408128
H  2.231461 -1.33418 0.071039
H  -0.142293 0.064904 -1.436225
H  -0.325427 -0.915007 0.033858
H  3.965676 1.22674 -0.186554
H  3.797638 0.25446 1.293451
H  -1.078112 2.071054 -0.187649
H  -1.335609 1.053625 1.248903
H  4.791038 -1.72938 0.116893
H  4.962592 -0.742521 -1.38248
H  -2.73819 0.574624 -1.502392
H  -3.643909 0.293868 1.44575
H  -5.857641 0.554232 0.119441
H  -5.055224 -0.142478 -1.306134
H  6.950757 -0.664656 -0.020297
H  -4.762424 -2.341547 -0.062183
H  -6.487647 -1.859437 -0.09632
H  -5.520288 -1.628929 1.389474
