program: Gaussian 09
title: 000268021
version: EM64L-G09RevD.01
frameworkgroup: C1[X(C15H9NO)]
method: RPBEPBE
basis: SDD
operation: Freq
keyword: #p
keyword: freq=noraman
keyword: PBEPBE/SDD
title: #p freq=noraman PBEPBE/SDD
converged: NO NO NO NO
title: Mulliken charges:
elementType: O N C C C C C C C C C C C C C C C H H H H H H H H H
charge: -0.261471 0.000414 0.219314 0.196183 0.189604 0.179527 -0.569036 0.345822 0.451386 -0.564733 -0.382804 -0.358219 -0.338714 -0.515299 -0.238472 -0.213740 -0.354685 0.249039 0.264399 0.242869 0.258632 0.239419 0.254148 0.229921 0.233447 0.243049
chargesum: 0.00000
title: Mulliken charges with hydrogens summed into heavy atoms:
elementType: O N C C C C C C C C C C C C C C C
charge: -0.261471 0.000414 0.219314 0.196183 0.189604 0.179527 -0.319997 0.345822 0.451386 -0.300334 -0.139935 -0.099587 -0.099295 -0.261151 -0.008552 0.019707 -0.111637
polarizability: 3.29448762e+02 -2.67650213e+00 1.66154330e+02 -5.92227277e-04 -9.19949927e-04 6.42994052e+01
1716.lowfreq: -7.5126 -0.0010 -0.0004 0.0009 4.4059 17.3261 67.0707 106.5367 153.2804
frequency: 67.0705 106.5333 153.2797 167.2884 221.1975 307.1776 310.8409 336.4359 342.9486 404.7350 444.7086 472.1199 488.9754 540.3819 558.3436 576.9254 579.5085 612.2294 643.0468 708.0668 710.1215 753.1383 754.2856 768.5693 775.8602 784.7145 820.9217 833.7252 865.0847 883.5070 891.2727 895.0283 940.0425 944.9169 964.3534 967.1264 982.5661 1012.4089 1020.6472 1090.9259 1113.0811 1159.4336 1164.0287 1183.1187 1209.5951 1228.8426 1245.5505 1257.2434 1297.4319 1342.7242 1367.5107 1398.0727 1413.0447 1415.4778 1444.7546 1446.3191 1465.2779 1479.7853 1573.9363 1585.0217 1605.3080 1618.5654 1654.9963 3102.0031 3134.1158 3134.5590 3136.4005 3146.1763 3160.5583 3163.2502 3164.7948 3177.4900
redmass: 5.6088 4.3899 5.4539 5.6618 4.4832 5.6350 4.2409 6.6659 6.4916 3.3473 2.9322 2.8109 7.7694 5.6916 4.1214 6.7379 4.2918 7.8812 7.2144 6.5271 4.7651 6.5175 2.0766 1.9587 5.3849 2.5457 1.3706 5.8851 1.3882 1.4548 5.4847 1.4939 1.6249 1.4025 5.9738 1.4398 1.3145 2.0599 2.5246 2.4061 2.5879 1.5548 1.5528 1.7047 2.1487 1.3251 2.8730 2.1493 1.8201 1.5333 5.6380 5.5778 2.2207 3.1598 2.6947 4.3379 3.5136 3.3625 7.6502 6.9120 7.4505 7.7805 8.4559 1.0910 1.0876 1.0868 1.0916 1.0911 1.0984 1.0961 1.0935 1.0987
irintensity: 0.2416 1.3531 0.3759 1.8863 0.6501 0.1409 0.0440 0.1118 1.0699 1.8319 0.7609 20.4887 0.6576 0.7621 0.6389 1.2433 7.2832 11.6375 2.1780 11.5583 6.0185 7.8242 47.8394 48.0052 1.2753 5.5115 8.7501 28.0121 0.1952 10.7098 0.8861 63.6646 15.5817 1.3258 17.6770 2.5441 0.0195 16.6877 2.5493 13.0110 80.2616 28.4877 9.0723 31.1028 44.2046 3.7030 19.8428 17.4730 19.8251 1.5635 1.8861 5.2641 9.9177 0.2125 87.1866 33.4684 3.6022 20.0895 2.4049 9.0581 13.4487 41.3483 7.3226 16.7379 1.4656 1.4445 4.3981 9.1894 38.7976 21.1617 3.3533 14.1057
temp: 298.150 k
press: 1.00000 atm
elementType: 8 7 6 6 6 6 6 6 6 6 6 6 6 6 6 6 6 1 1 1 1 1 1 1 1 1
symmnumber: 1
zpe: 512537.0 jmol-1
zpe.correction: 0.195215 hartree
zpe.thermalcorrener: 0.206551 hartree
zpe.thermalcorrenthalpy: 0.207495 hartree
zpe.thermalcorrgfe: 0.157853 hartree
zpe.sumelectzpe: -705.856607 hartree
zpe.sumelectthermal: -705.845270 hartree
zpe.sumelectthermalent: -705.844326 hartree
zpe.sumelectthermalfe: -705.893969 hartree
dipole: -3.1637 -0.3267 0.0000
dipole: 3.1805
quadrupole: -96.2889 -87.9530 -103.1976
quadrupole: -12.0306 0.0001 -0.0001
quadrupole: -0.4757 7.8601 -7.3844 -12.0306 0.0001 -0.0001
hfenergy: -706.0518217 hartree
pointgroup: C01 [X(C15H9N1O1)]
dipole: -1.2451447 0.1240309 -0.0000056 debye
dipolederiv: -1.5581719 -0.1608674 -0.0000041 -0.0349201 -0.4549073 0.000002 -0.0000083 0.0000016 -0.1574741 -0.626297 -0.0554142 -0.0000066 -0.0611561 -0.2957479 -0.0000017 0.0000026 -0.000001 -0.2524184 0.2593867 -0.0620752 0.0000005 0.3821935 -0.1257708 0.0000035 -0.0000053 0.0000023 0.0063996 0.0455161 0.1603598 -0.0000012 -0.2689891 -0.1368845 -0.0000003 0.0000001 0.0000011 -0.0068702 1.0187803 -0.1192978 0.0000047 -0.7190206 0.1922903 -0.0000041 0.0000126 -0.0000017 0.0830538 0.6609583 0.3122238 0. 0.748524 0.3661158 0.0000012 -0.0000014 -0.0000006 0.0736635 0.0776668 0.0057407 0.0000029 -0.0078277 0.1153406 -0.0000026 0.0000029 -0.0000047 -0.1458017 -0.1933231 0.0368208 0.0000008 0.1914875 -0.2610727 0.0000041 -0.0000002 0.0000017 0.0741784 0.2576693 -0.0629285 0.0000003 -0.2167198 -0.0020477 -0.000002 -0.0000059 -0.0000014 0.0339422 -0.3891108 0.0588385 -0.0000004 0.0654104 0.0808684 -0.0000022 -0.0000014 -0.0000011 -0.1914166 0.1337551 -0.0736577 0.0000016 0.1132669 0.0990503 -0.0000018 0.0000005 -0.000002 -0.1368668 -0.130877 -0.1740201 0.0000015 -0.1395557 0.014461 -0.0000023 0.0000012 -0.0000022 -0.166922 -0.204762 0.0112787 0.0000011 0.1961724 0.0809904 0. 0. -0.0000025 -0.1350054 0.4117817 -0.0495952 0.0000054 -0.1731169 0.3375222 -0.0000015 0.0000002 0.0000179 -0.0747228 -0.1918855 0.1253695 -0.0000011 0.2254572 -0.0162199 -0.0000007 -0.0000019 -0.000001 -0.1693219 -0.0062549 0.0115942 0.0000006 -0.134241 0.0943967 -0.0000029 0.0000025 -0.0000025 -0.1591231 0.2565893 0.1922243 -0.0000049 0.0551286 0.1632949 -0.000001 0.0000059 -0.000005 -0.1064388 0.0713144 -0.0117512 -0.0000005 -0.0408898 -0.05817 0.0000014 0.0000003 0.0000027 0.1543089 0.072836 -0.0349661 0. -0.0096461 -0.0251293 0.0000015 0.0000007 0.0000018 0.179757 0.0705498 0.083762 -0.0000011 0.0319137 -0.053996 0.000002 -0.0000005 0.0000019 0.1552449 0.0811355 0.0292395 -0.0000006 0.0676197 -0.0318759 0.0000023 -0.0000012 0.0000018 0.1823775 0.0764173 0.0138589 0.0000002 -0.0871091 -0.0989379 0.0000014 0.0000014 0.0000017 0.1560751 0.0694717 -0.0754728 0.0000002 -0.0153968 -0.0968183 0.0000003 0.0000001 -0.0000124 0.1234361 -0.0272701 -0.0955766 0.0000002 -0.1212864 -0.0314812 0.0000014 0. 0.0000014 0.1662342 -0.1284772 0.0299788 -0.0000013 0.0229173 0.0885666 0.0000008 -0.0000014 0.000001 0.1620788 -0.1073987 -0.0956668 0.0000017 -0.0702159 0.0561623 0.000001 -0.0000038 0.0000013 0.1516319 unknown
polarizability: 329.4272643|3.267057|166.1758277|0.0005956|-0.0009178|64.2994052 unknown
InChI: InChI=1S/C15H9NO/c1-2-4-14-12(3-1)13-7-11-9-16-6-5-10(11)8-15(13)17-14/h1-9H
charge 0 multiplicity 1
26 atoms
O  -1.398866 1.786298 -0.000045
N  4.419737 -1.096575 -0.000014
C  -0.425769 -0.361174 -0.000025
C  -1.880844 -0.516901 -0.000027
C  -0.180088 1.06422 -0.000032
C  -2.424918 0.801038 -0.000042
C  0.661583 -1.237499 -0.000016
C  1.987313 -0.697274 -0.00001
C  2.201933 0.740391 -0.000022
C  1.081032 1.635952 -0.000031
C  -2.763478 -1.620444 -0.00002
C  -3.796376 1.075939 -0.00005
C  3.560687 1.203778 -0.000025
C  3.152243 -1.543998 0.000013
C  -4.155877 -1.372264 -0.000027
C  -4.663927 -0.044803 -0.000042
C  4.60694 0.28113 -0.000029
H  0.525008 -2.325012 -0.000007
H  1.225651 2.7200 -0.000038
H  -2.383699 -2.647943 -0.00001
H  -4.174313 2.101915 -0.000061
H  3.769612 2.279177 -0.000031
H  3.020665 -2.634507 -0.000005
H  -4.854548 -2.215561 -0.000022
H  -5.746923 0.1192 -0.000048
H  5.652223 0.606315 -0.000033
